{"text_format":"1","workbook":"xlsx","n_sheets":5,"sheets":["Form","Dropdown","ResponseForm","LD Table","OutcomeForm"],"not_rendered":{"charts":0,"images":3,"macros":1,"external_links":0,"defined_names":1,"comments":1,"pivot_tables":0},"unopened":[],"bounds":{"document_bytes":16777216,"sheet_cells":100000,"rows_first":2000,"rows_last":500,"rows_between":2000,"halvings":0,"cell_chars":16384,"cell_head_chars":4096},"cells_cut":0,"cells_raw":0,"read":"whole","date_system":"1900"}

{"sheet":"Form","index":0,"n_rows":19,"n_cols":8,"rows_kept":19,"cut":false,"hidden":false,"merged":[[17,1,17,4],[13,1,13,4],[17,5,17,6],[16,1,16,6],[1,2,1,7],[15,1,15,6],[5,5,5,6],[7,5,7,6],[9,5,9,6],[11,5,11,6],[13,5,13,6]]}
[]
[null,null,"Estimated LD Calculation Form"]
[]
[null,"*All fields are mandatory. Please do not leave any blanks."]
[]
["*","Undergraduate Matric No.:"]
[]
["*","Matriculation Year:",null,null,null,{"$f":"VLOOKUP($F$6,Dropdown!A13:B32,2,TRUE)","v":{"$error":"#N/A"}},null,"e.g. 2019, 2020"]
[]
["*","Scholarship Scheme",null,null,null,{"$f":"VLOOKUP($F$6,Dropdown!E2:G5281,3,FALSE)","v":{"$error":"#N/A"}}]
[]
["*","Degree Type",null,null,null,{"$f":"VLOOKUP($F$6,Dropdown!E2:I5281,4,FALSE)","v":{"$error":"#N/A"}}]
[]
["*","Do you have any existing BG placed for"]
[null,"your deferment?"]
[null,{"$f":"IF($F14=\"Yes\",\"You have selected, Yes. Please input your BG amount in the section below.\",\"\")","v":""}]
[null,{"$f":"IF($F14=\"No\",\"You have selected, No. Please input 0 in the section below.\",\"\")","v":""}]
["*","Please enter your BG amount, if any"]
[null,"(BG is in SGD, please do not key in $ sign)"]

{"sheet":"Dropdown","index":1,"n_rows":5281,"n_cols":9,"rows_kept":5281,"cut":false,"hidden":true,"merged":[]}
["<Please Select>","<Please Select>",null,"SCHOLAR NAME","MATRIC NO","SCHEME","SCHEME_EDITED","DEGREE TYPE","COURSE"]
["No bridging","Single",null,"LONG TAO","001511A03","SM3","SM2-AP/SM3",{"$f":"VLOOKUP(I$1:I$5281,$A$37:$B$212,2,FALSE)","v":"Single"},"EEE"]
["SM2-RP","Double",null,"SETHIA ADITYA","003677D07","Direct","No bridging","Single","MAT"]
["SM2-AP/SM3","Double (Type 1)",null,"MAO DINGTAO","010004E03","SM3","SM2-AP/SM3","Single","EEE"]
["SM2 (20 MTHS)","Double (Type 2)",null,"CHEN HAOMIN","010025B03","SM2 (Accelerated)","SM2-AP/SM3","Single","MPE"]
["SM2 (12 MTHS)",null,null,"LI RUI","010027F03","SM3","SM2-AP/SM3","Single","EEE"]
["SM3",null,null,"WANG RUI","010042B03","SM3","SM2-AP/SM3","Single","EEE"]
[null,null,null,"KANG BAOXIANG","010044F03","SM3","SM2-AP/SM3","Single","EEE"]
[null,null,null,"LENG ZILI","010067G03","SM3","SM2-AP/SM3","Single","EEE"]
[null,null,null,"FENG LIGUO","010089F03","SM3","SM2-AP/SM3","Single","EEE"]
[null,null,null,"XIAO LIANHOU","010095A03","SM3","SM2-AP/SM3","Single","EEE"]
["Matric starts with…","Year",null,"LU FEN","010102E03","SM3","SM2-AP/SM3","Single","EEE"]
["01",2001,null,"WANG YANG","010103G03","SM3","SM2-AP/SM3","Single","EEE"]
["02",2002,null,"ZHANG YAO","010106B03","SM3","SM2-AP/SM3","Single","EEE"]
["03",2003,null,"ZHANG XIN (F2589661X)","010115C03","MOE PreU Scholar (PRC)","No bridging","Single","EEE"]
["04",2004,null,"SHI WEN","010135J03","SM3","SM2-AP/SM3","Single","EEE"]
["05",2005,null,"ZHOU HUIJUN","010158K03","SM3","SM2-AP/SM3","Single","EEE"]
["06",2006,null,"SHANG LONG","010162A03","SM2","SM2-RP","Single","EEE"]
["07",2007,null,"CUI SONG","010165G03","SM2 (Accelerated)","SM2-AP/SM3","Single","EEE"]
["08",2008,null,"HU KUN","010171B03","SM3","SM2-AP/SM3","Single","EEE"]
["U09",2009,null,"ZHAO MING","010179G03","SM3","SM2-AP/SM3","Single","EEE"]
["U10",2010,null,"HAO ZHIYONG","010197J03","SM3","SM2-AP/SM3","Single","EEE"]
["U11",2011,null,"FU YING","010208K03","SM3","SM2-AP/SM3","Single","EEE"]
["U12",2012,null,"ZHANG YU (150052688)","010230C03","SM3","SM2-AP/SM3","Single","EEE"]
["U13",2013,null,"CHEN LIN (150442624)","010247J03","SM3","SM2-AP/SM3","Single","EEE"]
["U14",2014,null,"GE TONG","010249B03","SM2","SM2-RP","Single","EEE"]
["U15",2015,null,"LU JUNLONG","010254F03","SM3","SM2-AP/SM3","Single","EEE"]
["U16",2016,null,"WU DI","010255H03","SM3","SM2-AP/SM3","Single","EEE"]
["U17",2017,null,"CHU HAIZHOU","010256K03","SM3","SM2-AP/SM3","Single","EEE"]
["U18",2018,null,"LI LINTAO","010261C03","SM3","SM2-AP/SM3","Single","EEE"]
["U19",2019,null,"JIANG ZONGQI","010274A03","SM2","SM2-RP","Single","EEE"]
["U20",2020,null,"CHEN JUNJIE","010276E03","SM3","SM2-AP/SM3","Single","EEE"]
[null,null,null,"LI XIANGNAN","010293E03","SM3","SM2-AP/SM3","Single","EEE"]
[null,null,null,"ZHAO JIHUA","010295J03","SM3","SM2-AP/SM3","Single","EEE"]
[null,null,null,"WANG ZHISHUAI","010297B03","SM3","SM2-AP/SM3","Single","EEE"]
["PROGRAMME CODE","DEGREE TYPE",null,"ABHISHEK GUPTA","010299F03","SIA Youth","No bridging","Single","EEE"]
["ABET","Double",null,"LI WEI (G00241105)","010305H03","SM3","SM2-AP/SM3","Single","EEE"]
["ABTD","Double",null,"ZHUANG ZHENGDA","010327G03","MOE PreU Scholar (PRC)","No bridging","Single","EEE"]
["ACBS","Double",null,"WANG LIANG","010335F03","SM2 (Accelerated)","SM2-AP/SM3","Single","EEE"]
["ACC","Single",null,"WANG JUN (G00241109)","010347B03","SM3","SM2-AP/SM3","Single","EEE"]
["ACDA","Double",null,"ANNA REGINA","010356C03","MOE PreU Scholar (ASEAN)","No bridging","Single","MPE"]
["ACET","Single",null,"TANG WENLI","010357E03","SM2","SM2-RP","Single","EEE"]
["ACFA","Single",null,"ZHAN CHUNLEI","010364B03","SM3","SM2-AP/SM3","Single","EEE"]
["ACSC","Single",null,"LIU LEI (147660000)","010366F03","SM2","SM2-RP","Single","EEE"]
["ACTD","Single",null,"PUNGKY PRADOTO","010380L03","Direct","No bridging","Single","EEE"]
["ADDA","Single",null,"XU JUN","010381B03","SM3","SM2-AP/SM3","Single","EEE"]
["ADM","Single",null,"YANG MING (G00241111)","010387C03","SM3","SM2-AP/SM3","Single","EEE"]
["AERO","Single",null,"LI MING","010394L03","SM3","SM2-AP/SM3","Single","EEE"]
["ARED","Single",null,"FU PENG","010405A03","SM3","SM2-AP/SM3","Single","EEE"]
["ASBM","Single",null,"LI ZHE (G00241104)","010406C03","SM3","SM2-AP/SM3","Single","EEE"]
["ASBZ","Single",null,"SUN ZHENGLONG","010407E03","SM3","SM2-AP/SM3","Single","EEE"]
["ASDA","Single",null,"LI HAOXIN","010444L03","SM3","SM2-AP/SM3","Single","EEE"]
["ASEC","Double",null,"YANG SHU","010457J03","SM2","SM2-RP","Single","EEE"]
["ASET","Single",null,"HAN YEHUA","010458L03","SM3","SM2-AP/SM3","Single","EEE"]
["ASTD","Single",null,"QIN JING","010463D03","SM2","SM2-RP","Single","EEE"]
["BCE","Double (Type 1)",null,"PENG NING","010466K03","SM3","SM2-AP/SM3","Single","EEE"]
["BCG","Double (Type 1)",null,"HUANG TAO","010514F03","SM2","SM2-RP","Single","EEE"]
["BEBM","Single",null,"HUANG MINGMING","010528F03","SM3","SM2-AP/SM3","Single","EEE"]
["BEBZ","Single",null,"WU LIN","010546H03","SM3","SM2-AP/SM3","Single","EEE"]
["BEDA","Single",null,"LIANG XUEBIN","010556L03","SM3","SM2-AP/SM3","Single","EEE"]
["BEEC","Double (Type 2)",null,"DENG WU","010557B03","SM2","SM2-RP","Single","EEE"]
["BEET","Single",null,"IRWAN MOHAMMAD","010563H03","Direct","No bridging","Single","MPE"]
["BEFS","Single",null,"HAJAR SENOHADI SUSILO","010575D03","Direct","No bridging","Single","EEE"]
["BEPE","Single",null,"LING YONG","010581K03","SM3","SM2-AP/SM3","Single","EEE"]
["BETD","Single",null,"GUPTA RUCHI","010591B03","Direct","No bridging","Single","EEE"]
["BIE","Single",null,"RATH SAMIR","010597C03","Direct","No bridging",{"$f":"VLOOKUP(I$1:I$5281,$A$37:$B$212,2,FALSE)","v":"Single"},"EEE"]
["BMS","Double",null,"SUREKA RIMA SUDARSHAN","010604G03","Direct","No bridging","Single","EEE"]
["BS","Single",null,"YANG JIANBO","010609F03","SM3","SM2-AP/SM3","Single","EEE"]
["BSB","Single",null,"CHEN ZHIMING","010621G03","SM3","SM2-AP/SM3","Single","EEE"]
["BSBZ","Single",null,"DALVI ABHAY SHASHANK","010623L03","Direct","No bridging","Single","EEE"]
["BSCB","Single",null,"YU YING","010636J03","SM3","SM2-AP/SM3","Single","EEE"]
["BSDA","Single",null,"MENG YUSONG","010647C03","SM3","SM2-AP/SM3","Single","EEE"]
["BSFS","Single",null,"NIU SHIJIE","010654L03","SM3","SM2-AP/SM3","Single","EEE"]
["BSMT","Single",null,"CHEN YI","010663A03","SM3","SM2-AP/SM3","Single","EEE"]
["BSPY","Single",null,"SONG HUILAI","010681C03","SM3","SM2-AP/SM3","Single","EEE"]
["BSSB","Single",null,"LU LINHUI","010685L03","SM2 (Accelerated)","SM2-AP/SM3","Single","EEE"]
["BUET","Single",null,"TIAN YONG","010700C03","SM3","SM2-AP/SM3","Single","CEE"]
["BUS","Single",null,"SANTHANAM SUBA","010711H03","Direct","No bridging","Single","EEE"]
["BUSC","Single",null,"VARUN NARAYAN VISWANATH","010716G03","Direct","No bridging","Single","EEE"]
["BUTD","Single",null,"TEGUH DANIEL TAMPEMAWA","010718L03","MOE PreU Scholar (ASEAN)","No bridging","Single","MPE"]
["CBBM","Single",null,"ZHANG GUO","010742H03","SM2","SM2-RP","Single","EEE"]
["CBBZ","Single",null,"YAMINI JAGANNADHAN","010751J03","Direct","No bridging","Single","EEE"]
["CBDA","Single",null,"LIN JIANYONG","010762C03","SM3","SM2-AP/SM3","Single","EEE"]
["CBE","Single",null,"WANG MENGDI","010809C03","SM3","SM2-AP/SM3","Single","EEE"]
["CBEC","Double (Type 2)",null,"SUN ZHENGLIANG","010810K03","SM3","SM2-AP/SM3","Single","EEE"]
["CBET","Single",null,"PANG YI","010816L03","SM3","SM2-AP/SM3","Single","EEE"]
["CBFS","Single",null,"JIA XIAOWEI","010818D03","SM2","SM2-RP","Single","EEE"]
["CBTD","Single",null,"GONG YING","010829J03","SM3","SM2-AP/SM3","Single","EEE"]
["CE","Single",null,"CHEN MING (150101485)","010864L03","SM3","SM2-AP/SM3","Single","EEE"]
["CEBM","Single",null,"VIKRAM BAJAJ","010873A03","Direct","No bridging","Single","EEE"]
["CEBZ","Single",null,"HE JIAO","010896B03","SM2","SM2-RP","Single","EEE"]
["CEDA","Single",null,"PERDANA HADI AINIANTA","010912G03","Direct","No bridging","Single","EEE"]
["CEE","Single",null,"QUE YI","010914L03","SM2","SM2-RP","Single","ME"]
["CEEC","Double (Type 2)",null,"ZHU JIA","010928L03","SM3","SM2-AP/SM3","Single","EEE"]
["CEET","Single",null,"VALDY OKTAFIANZA","010930J03","Direct","No bridging","Single","EEE"]
["CETD","Single",null,"WU JIE","010977B03","SM3","SM2-AP/SM3","Single","EEE"]
["CHDA","Single",null,"LENG SHUANG","010987E03","SM3","SM2-AP/SM3","Single","EEE"]
["CHEM","Single",null,"ZHU ZHIMING","011016H03","SM3","SM2-AP/SM3","Single","EEE"]
["CHES","Single",null,"LIU WEN","011017K03","SM3","SM2-AP/SM3","Single","EEE"]
["CHFS","Single",null,"ZHU QI","011020K03","SM3","SM2-AP/SM3","Single","EEE"]
["CHIN","Single",null,"LI TIAN","011028D03","SM2","SM2-RP","Single","EEE"]
["CHTD","Single",null,"ZHANG ZEYUAN","011037E03","SM3","SM2-AP/SM3","Single","EEE"]
["CNEL","Single",null,"BEKTI HARSONO","011039J03","Direct","No bridging","Single","EEE"]
["CNLM","Single",null,"YU CHUNXIN","011040E03","SM3","SM2-AP/SM3","Single","EEE"]
["CS","Single",null,"SHANG YANG","011042J03","SM3","SM2-AP/SM3","Single","EEE"]
["CSBM","Single",null,"SUN CHUAN","011052A03","SM3","SM2-AP/SM3","Single","EEE"]
["CSBU","Single",null,"HOU YUEJIN","011059D03","SM3","SM2-AP/SM3","Single","EEE"]
["CSBZ","Single",null,"SU CUI","011066A03","SM3","SM2-AP/SM3","Single","EEE"]
["CSC","Single",null,"LIU XIMING","011076D03","SM3","SM2-AP/SM3","Single","EEE"]
["CSEC","Double",null,"DONG ZHAOGANG","011083A03","SM2 (Accelerated)","SM2-AP/SM3","Single","EEE"]
["CSET","Single",null,"WAN LIANGXUN","011101K03","SM3","SM2-AP/SM3","Single","EEE"]
["CSGR","Single",null,"GUO HAO","011109D03","SM3","SM2-AP/SM3","Single","EEE"]
["CSTD","Single",null,"WANG YAN","011112D03","SM3","SM2-AP/SM3","Single","EEE"]
["CVBM","Single",null,"ZHOU LEI","011117C03","SM3","SM2-AP/SM3","Single","EEE"]
["CVBZ","Single",null,"PAN FENG","011122G03","SM3","SM2-AP/SM3","Single","EEE"]
["CVDA","Single",null,"LI XIANG (147671058)","011129K03","SM2","SM2-RP","Single","EEE"]
["CVEC","Double (Type 2)",null,"LI DANPING","011133A03","SM3","SM2-AP/SM3","Single","EEE"]
["CVET","Single",null,"GAO SHU","011146K03","SM3","SM2-AP/SM3","Single","EEE"]
["CVSU","Single",null,"YANG ZHONGBAO","011154J03","SM3","SM2-AP/SM3","Single","CEE"]
["CVTD","Single",null,"WANG YUBO","011169L03","SM3","SM2-AP/SM3","Single","EEE"]
["DSAI","Single",null,"CHRISTIAN KWARTILA CANDRA","011204J03","Direct","No bridging","Single","EEE"]
["ECBU","Single",null,"HE HAO","011227K03","SM2","SM2-RP","Single","CEE"]
["ECDS","Single",null,"SURYANTI YUNITA ANGGRELLY","011260H03","Direct","No bridging","Single","EEE"]
["ECMA","Single",null,"LING JIWEN","011267L03","SM3","SM2-AP/SM3","Single","EEE"]
["ECON","Single",null,"ZHANG ZHANG","011290F03","MOE PreU Scholar (PRC)","No bridging","Single","EEE"]
["ECPP","Single",null,"ZHANG YI","011348L03","SM2","SM2-RP","Single","EEE"]
["ECPS","Single",null,"ZHANG JIAN","011352B03","SM2","SM2-RP","Single","EEE"]
["EEBM","Single",null,"SAMVITA RAVINDRANATH PADUKONE","011354F03","SIA Youth","No bridging","Single","EEE"]
["EEBZ","Single",null,"FANG CHAO","011358C03","SM3","SM2-AP/SM3","Single","EEE"]
["EEDA","Single",null,"ANDY NUGROHO SOETIKNO","011361C03","Direct","No bridging",{"$f":"VLOOKUP(I$1:I$5281,$A$37:$B$212,2,FALSE)","v":"Single"},"EEE"]
["EEE","Single",null,"SHAO LUN","011379L03","SM2 (Accelerated)","SM2-AP/SM3","Single","EEE"]
["EEEC","Double (Type 2)",null,"CHEN LIQING (150101460)","011388A03","SM3","SM2-AP/SM3","Single","EEE"]
["EEET","Single",null,"JIAO YANG","011390K03","SM2","SM2-RP","Single","CEE"]
["EESS","Single",null,"ZHANG FENG","011392C03","SM3","SM2-AP/SM3","Single","EEE"]
["EESU","Single",null,"CHEN JIA","011401L03","SM2","SM2-RP","Single","EEE"]
["EETD","Single",null,"FAN KAI","011402B03","SM3","SM2-AP/SM3","Single","EEE"]
["EGBZ","Single",null,"LIU YANG","011421F03","SM3","SM2-AP/SM3","Single","EEE"]
["EGTD","Single",null,"XIONG JIE","011429L03","SM3","SM2-AP/SM3","Single","EEE"]
["ELAH","Single",null,"SHEN YANG","011456C03","SM3","SM2-AP/SM3","Single","EEE"]
["ELH","Single",null,"ZHENG CHAO","011457E03","SM3","SM2-AP/SM3","Single","EEE"]
["ELHS","Single",null,"GU MINGXIA","011461G03","SM3","SM2-AP/SM3","Single","EEE"]
["ELPL","Single",null,"CHEN KAICHENG","011462J03","SM3","SM2-AP/SM3","Single","EEE"]
["ENBM","Single",null,"DUAN LIAN","011463L03","SM3","SM2-AP/SM3","Single","EEE"]
["ENBZ","Single",null,"WANG HONGJUN","011468K03","SM3","SM2-AP/SM3","Single","EEE"]
["ENDA","Single",null,"YANG BO","011478B03","SM2","SM2-RP","Single","EEE"]
["ENE","Single",null,"QIAN XIAODONG","011479D03","SM3","SM2-AP/SM3","Single","EEE"]
["ENEC","Double (Type 2)",null,"CHEN KAICHENG","011480L03","SM3","SM2-AP/SM3","Single","EEE"]
["ENET","Single",null,"LUAN YONG","011489G03","SM3","SM2-AP/SM3","Single","EEE"]
["ENG","Single",null,"SHE HONGMEI","011493J03","SM3","SM2-AP/SM3","Single","MPE"]
["ENSU","Single",null,"SWATHISH RAM AYYAPPAN","011512J03","Direct","No bridging","Single","EEE"]
["ENTD","Single",null,"NATALIA FILO SUTANTO","011514B03","MOE PreU Scholar (ASEAN)","No bridging","Single","EEE"]
["ESDA","Single",null,"ZHENG HUA","011515D03","SM3","SM2-AP/SM3","Single","EEE"]
["ESPP","Single",null,"SHEN XIAOXIN","011536A03","SM3","SM2-AP/SM3","Single","EEE"]
["HIST","Single",null,"DONG YONGSHENG","011547F03","SM3","SM2-AP/SM3","Single","EEE"]
["HSCN","Single",null,"HU KE","011554C03","SM3","SM2-AP/SM3","Single","EEE"]
["HSLM","Single",null,"LU JI","011558L03","SM2","SM2-RP","Single","EEE"]
["IEBM","Single",null,"TONG LING","011568C03","SM3","SM2-AP/SM3","Single","EEE"]
["IEBZ","Single",null,"ZHANG JILIANG","011599C03","SM3","SM2-AP/SM3","Single","EEE"]
["IEDA","Single",null,"REN LINGLING","011604C03","SM3","SM2-AP/SM3","Single","EEE"]
["IEEC","Double (Type 2)",null,"FU WEI","011613D03","SM3","SM2-AP/SM3","Single","EEE"]
["IEET","Single",null,"WU DAN","013002B06","SM2","SM2-RP","Single","CE"]
["IEM","Single",null,"TAN LI","013003D06","SM3","SM2-AP/SM3","Single","CE"]
["IETD","Single",null,"ZHANG TIANYOU","013013G06","SM2","SM2-RP","Single","CE"]
["LMEL","Single",null,"LIU MING","013019H06","SM3","SM2-AP/SM3","Single","CE"]
["LMPL","Single",null,"NIMESH NATVARLAL DUBAL","013024A06","SIA Youth","No bridging","Single","CE"]
["LMS","Single",null,"SOUMYA PATI","013028J06","SIA Youth","No bridging","Single","CE"]
["MACS","Single",null,"RONY JOSEPH PALATHINKAL","013032L06","SIA Youth","No bridging","Single","CE"]
["MADA","Single",null,"CHATHAPURAM V SATISH RAMANATH","013045J06","SIA Youth","No bridging","Single","CE"]
["MAEC","Single",null,"SHIKHA AGARWAL","013056C06","SIA Youth","No bridging","Single","CE"]
["MAEO","Single",null,"HU LILI","013059J06","SM3","SM2-AP/SM3","Single","CE"]
["MAFI","Single",null,"LI DONG","013066F06","SM3","SM2-AP/SM3","Single","CE"]
["MAT","Single",null,"ANAR VINAY PITRE","013078B06","SIA Youth","No bridging","Single","CE"]
["MATH","Single",null,"ZHU BO","013092G06","SM3","SM2-AP/SM3","Single","CE"]
["ME","Single",null,"QIN ZHEN","013109J06","SM2","SM2-RP","Single","CE"]
["MEBM","Single",null,"LI ZHONGYI","013129D06","SM2","SM2-RP","Single","CE"]
["MEBZ","Single",null,"NAVEEN KUMAR VOHRA","013140C06","SIA Youth","No bridging","Single","CE"]
["MED","Single",null,"WANG LEI (150353908)","013151H06","SM2 (Accelerated)","SM2-AP/SM3","Single","CE"]
["MEDA","Single",null,"CHEN SHANSHAN","013161L06","SM2","SM2-RP","Single","CE"]
["MEEC","Double (Type 2)",null,"ZHU XI","013219E06","SM2","SM2-RP","Single","CE"]
["MEET","Single",null,"ZHU WENJUN","013221C06","SM3","SM2-AP/SM3","Single","CE"]
["MESU","Single",null,"RAO MAYANK","013238J06","Direct","No bridging","Single","CE"]
["METD","Single",null,"LI YUANYUAN","013243B06","SM2","SM2-RP","Single","CE"]
["MS","Single",null,"ROHIT KUMAR","013247K06","Direct","No bridging","Single","CE"]
["MSB","Single",null,"SANTANU KUMAR DASH","013248A06","Direct","No bridging","Single","CE"]
["MSDA","Single",null,"SAWHNEY ADITI","013252C06","Direct","No bridging","Single","CE"]
["MTBM","Single",null,"TAIYABI AHMAD SHADAB","013259F06","SIA Youth","No bridging","Single","CE"]
["MTBZ","Single",null,"PREETHI","013271G06","Direct","No bridging","Single","CE"]
["MTDA","Single",null,"KARUN BABU","013276F06","Direct","No bridging","Single","CE"]
["MTEC","Double (Type 2)",null,"PAN KE","013281K06","SM3","SM2-AP/SM3","Single","CE"]
["MTET","Single",null,"LUO LINBO","013282A06","SM3","SM2-AP/SM3","Single","CE"]
["MTMB","Single",null,"ZHANG RAN","013284E06","SM2","SM2-RP","Single","CE"]
["MTPE","Single",null,"TAN YANG","013287L06","SM3","SM2-AP/SM3","Single","CE"]
["MTTD","Single",null,"JOTHI SARANYA PRAKASH","013288B06","Direct","No bridging","Single","CE"]
["PHDA","Single",null,"DHARIWAL ALOK RAJ","013290L06","Direct","No bridging",{"$f":"VLOOKUP(I$1:I$5281,$A$37:$B$212,2,FALSE)","v":"Single"},"CE"]
["PHIL","Single",null,"RAMAKRISHNAN SOWMYA","013301A06","SIA Youth","No bridging","Single","CE"]
["PHMA","Single",null,"LI WEI","013328K06","SM3","SM2-AP/SM3","Single","CE"]
["PHME","Single",null,"YANG GUANG","013344H06","SM2 (Accelerated)","SM2-AP/SM3","Single","CE"]
["PHMP","Single",null,"MICHAEL SENJAYA KANG","013352G06","Direct","No bridging","Single","CE"]
["PHMS","Single",null,"LIU CHAO","013353J06","SM2","SM2-RP","Single","CE"]
["PHY","Single",null,"WANG YONGWEI","013369B06","SM3","SM2-AP/SM3","Single","CE"]
["PLCN","Single",null,"ZHANG JUNWEI","013371L06","SM3","SM2-AP/SM3","Single","CE"]
["PLHS","Single",null,"JIN DONG","013380A06","SM2","SM2-RP","Single","CE"]
["PPGA","Single",null,"WANG XIN (150375674)","013399L06","SM3","SM2-AP/SM3","Single","CE"]
["PSBS","Single",null,"RAHUL NATH","013460K06","SIA Youth","No bridging","Single","CE"]
["PSLM","Single",null,"YU TIAN","013486F06","SM2","SM2-RP","Single","CE"]
["PSMA","Single",null,"WANG YONGMIN","013500G06","SM2","SM2-RP","Single","CE"]
["PSY","Single",null,"NAVEEN PETER","013503B06","SIA Youth","No bridging","Single","CE"]
["REP","Single",null,"ANKIT SAREEN","013511A06","Direct","No bridging","Single","CE"]
["SCED","Single",null,"I MADE DWI SUMAHARDIKA ADI","013517B06","Direct","No bridging","Single","CE"]
["SOC","Single",null,"ZHONG YU","013520B06","SM2","SM2-RP","Single","CE"]
["SSM","Single",null,"CHEN OU","013521D06","SM2","SM2-RP","Single","CE"]
["MPE","Single",null,"NICOLE BUDIMAN","013528G06","Direct","No bridging","Single","CE"]
[null,null,null,"PIAO HAIJUN","013540H06","SM3","SM2-AP/SM3","Single","CE"]
[null,null,null,"CAO LI","013558E06","SM2","SM2-RP","Single","CE"]
[null,null,null,"DASARI MANU VIDYA","013568H06","SIA Youth","No bridging","Single","CE"]
[null,null,null,"KAVITA SRIDHARAN","013569K06","Direct","No bridging","Single","CE"]
[null,null,null,"DU GANG","013574C06","SM3","SM2-AP/SM3","Single","CE"]
[null,null,null,"JIN JUN","013579B06","SM3","SM2-AP/SM3","Single","CE"]
[null,null,null,"ZHENG BO","013637A06","SM3","SM2-AP/SM3","Single","CE"]
[null,null,null,"CUI HUANHUAN","013658F07","SM2","SM2-RP","Single","MAT"]
[null,null,null,"WU XUE","013659L06","SM2","SM2-RP","Single","CE"]
[null,null,null,"LIU ZHAOPI","013661J06","SM3","SM2-AP/SM3","Single","CE"]
[null,null,null,"SUN HONGYANG","013668A06","SM3","SM2-AP/SM3","Single","CE"]
[null,null,null,"YAN HUA","013677K07","SM3","SM2-AP/SM3","Single","MAT"]
[null,null,null,"LIU YANXIANG","013681D06","SM2","SM2-RP","Single","CE"]
[null,null,null,"ZHU JIANG (147601114)","013685A06","SM2","SM2-RP","Single","CE"]
[null,null,null,"BHATTACHARYA RUDRARUP","013689F07","Direct","No bridging","Single","MAT"]
[null,null,null,"LU YIXIANG","013702H06","SM3","SM2-AP/SM3","Single","CE"]
[null,null,null,"XUE DONG","013705C06","SM2 (Accelerated)","SM2-AP/SM3","Single","CE"]
[null,null,null,"ZHOU YU (147601077)","013728D06","SM2","SM2-RP","Single","CE"]
[null,null,null,"LI MIN (150101484)","013734K06","SM3","SM2-AP/SM3","Single","CE"]
[null,null,null,"LIU MINGHUI","013757H07","SM3","SM2-AP/SM3","Single","MAT"]
[null,null,null,"HUANG QIANG","013798L07","SM3","SM2-AP/SM3","Single","MAT"]
[null,null,null,"XIA YUN","013844C07","SM2","SM2-RP","Single","MAT"]
[null,null,null,"LIU YANYAN","020019B03","SM3","SM2-AP/SM3","Single","EEE"]
[null,null,null,"CHRISTIAN HADI SUPONO","020035L03","Direct","No bridging","Single","EEE"]
[null,null,null,"SINGH RISHABH","020095G03","Direct","No bridging","Single","EEE"]
[null,null,null,"XING HAIPENG","020106H03","SM3","SM2-AP/SM3","Single","EEE"]
[null,null,null,"HU JIAN","020108A03","SM3","SM2-AP/SM3","Single","EEE"]
[null,null,null,"PENG HONG","020109C03","SM3","SM2-AP/SM3","Single","EEE"]
[null,null,null,"XU SHASHA","020122F03","SM3","SM2-AP/SM3","Single","CEE"]
[null,null,null,"SU BOYANG","020140H03","SM3","SM2-AP/SM3","Single","ME"]
[null,null,null,"GUO WEI","020169K03","SM3","SM2-AP/SM3","Single","ME"]
[null,null,null,"FAN HEJIE","020178L03","SM3","SM2-AP/SM3","Single","EEE"]
[null,null,null,"LIANG ZHUORUI","020180J03","SM3","SM2-AP/SM3","Single","EEE"]
[null,null,null,"JIANG ZHIMIN","020202D03","SM2","SM2-RP","Single","EEE"]
[null,null,null,"ISHITA DHAMANI","020208E03","Direct","No bridging","Single","EEE"]
[null,null,null,"YANG XI","020214L03","SM3","SM2-AP/SM3","Single","EEE"]
[null,null,null,"AJAY CHANDY ANDREWS","020223A03","Direct","No bridging","Single","EEE"]
[null,null,null,"BAI XINZU","020230J03","SM3","SM2-AP/SM3","Single","EEE"]
[null,null,null,"ADITYO ASMORO PUTRO","020233D03","Direct","No bridging","Single","ME"]
[null,null,null,"YAN PENGYU","020235H03","SM2","SM2-RP","Single","EEE"]
[null,null,null,"WANG WENZHAO","020237A03","SM2","SM2-RP","Single","EEE"]
[null,null,null,"ZHANG HUIJUAN","020245L03","SM2","SM2-RP","Single","EEE"]
[null,null,null,"WANG XIYU","020256E03","SM3","SM2-AP/SM3","Single","EEE"]
[null,null,null,"ZOU QIAN","020272C03","SM2","SM2-RP","Single","EEE"]
[null,null,null,"LIU WEI","020276L03","SM3","SM2-AP/SM3","Single","ME"]
[null,null,null,"ZHANG NING","020278D03","SM2","SM2-RP",{"$f":"VLOOKUP(I$1:I$5281,$A$37:$B$212,2,FALSE)","v":"Single"},"EEE"]
[null,null,null,"GAO QIJIE","020313B03","SM3","SM2-AP/SM3","Single","EEE"]
[null,null,null,"LAN YUAN","020331D03","SM3","SM2-AP/SM3","Single","EEE"]
[null,null,null,"JIANG NAN","020334K03","SM2 (Accelerated)","SM2-AP/SM3","Single","EEE"]
[null,null,null,"RUDI HARTONO","020349A03","Direct","No bridging","Single","EEE"]
[null,null,null,"JONATHAN TAMIL","020352A03","Direct","No bridging","Single","EEE"]
[null,null,null,"ZHUANG FANG","020356J03","SM3","SM2-AP/SM3","Single","EEE"]
[null,null,null,"LI LIANG","020357L03","SM3","SM2-AP/SM3","Single","EEE"]
[null,null,null,"JIANG JISU","020364H03","SM3","SM2-AP/SM3","Single","EEE"]
[null,null,null,"WANG DUO","020367C03","SM3","SM2-AP/SM3","Single","EEE"]
[null,null,null,"PUNEET GULATI","020368E03","SIA Youth","No bridging","Single","ME"]
[null,null,null,"LIU XIAOGANG","020412D03","SM3","SM2-AP/SM3","Single","EEE"]
[null,null,null,"CHEN CAIXIA","020425B03","SM3","SM2-AP/SM3","Single","EEE"]
[null,null,null,"YUAN JINGXIA","020429K03","SM3","SM2-AP/SM3","Single","CEE"]
[null,null,null,"HUO NAN","020441L03","SM3","SM2-AP/SM3","Single","EEE"]
[null,null,null,"SHANG LEI","020450A03","SM3","SM2-AP/SM3","Single","EEE"]
[null,null,null,"CAI YU","020463K03","SM2","SM2-RP","Single","EEE"]
[null,null,null,"DAVIN SUGIMAN","020464A03","Direct","No bridging","Single","ME"]
[null,null,null,"SUN JIAXU","020469L03","SM2","SM2-RP","Single","EEE"]
[null,null,null,"LAKSHMI NANDAGUDI VASUDEVA RAO","020487B03","SIA Youth","No bridging","Single","EEE"]
[null,null,null,"LUO XUEWEN","020500A03","SM3","SM2-AP/SM3","Single","EEE"]
[null,null,null,"KADIR VEDACHALAM","020516E03","SIA Youth","No bridging","Single","ME"]
[null,null,null,"ALEX JAHYA","020544K03","MOE PreU Scholar (ASEAN)","No bridging","Single","ME"]
[null,null,null,"TANG WEIFENG","020555D03","SM3","SM2-AP/SM3","Single","EEE"]
[null,null,null,"LIU YAQING","020556F03","SM3","SM2-AP/SM3","Single","EEE"]
[null,null,null,"QIU PING","020565G03","SM3","SM2-AP/SM3","Single","EEE"]
[null,null,null,"YUE TAO","020588H03","SM3","SM2-AP/SM3","Single","EEE"]
[null,null,null,"FAN XIAO","020609A03","SM2","SM2-RP","Single","EEE"]
[null,null,null,"LAO JIAHONG","020616J03","SM3","SM2-AP/SM3","Single","EEE"]
[null,null,null,"REN JIALIANG","020617L03","SM3","SM2-AP/SM3","Single","EEE"]
[null,null,null,"CHEN XIZI","020632G03","SM2","SM2-RP","Single","EEE"]
[null,null,null,"LI XIAOLEI","020643A03","SM3","SM2-AP/SM3","Single","EEE"]
[null,null,null,"DENG LUMING","020656K03","SM2","SM2-RP","Single","EEE"]
[null,null,null,"PAN NINGNING","020662E03","SM3","SM2-AP/SM3","Single","EEE"]
[null,null,null,"ZHAO DAN","020665L03","SM3","SM2-AP/SM3","Single","EEE"]
[null,null,null,"SHEN JI","020666B03","MOE PreU Scholar (PRC)","No bridging","Single","ME"]
[null,null,null,"AVISHEK NANDY","020686H03","Direct","No bridging","Single","EEE"]
[null,null,null,"ZONG XICHENG","020687K03","SM3","SM2-AP/SM3","Single","EEE"]
[null,null,null,"YANG GAO","020694G03","SM3","SM2-AP/SM3","Single","EEE"]
[null,null,null,"YOSUA MIKO","020710A03","Direct","No bridging","Single","EEE"]
[null,null,null,"KAR MANABESH","020711C03","Direct","No bridging","Single","EEE"]
[null,null,null,"XU DAWEI","020727G03","SM3","SM2-AP/SM3","Single","EEE"]
[null,null,null,"TANG CHUAN","020728J03","SM3","SM2-AP/SM3","Single","EEE"]
[null,null,null,"ZHANG PENG","020742C03","SM3","SM2-AP/SM3","Single","EEE"]
[null,null,null,"LIU ZHIJIA","020745J03","SM3","SM2-AP/SM3","Single","EEE"]
[null,null,null,"IRFAN BIN ABID","020754K03","Direct","No bridging","Single","EEE"]
[null,null,null,"FIFTARINA PUSPITASARI","020757E03","Direct","No bridging","Single","EEE"]
[null,null,null,"WANG WEI","020779D03","SM3","SM2-AP/SM3","Single","ME"]
[null,null,null,"LU ZEWEN","020784H03","SM3","SM2-AP/SM3","Single","EEE"]
[null,null,null,"DIAO WENJIE","020816F03","SM3","SM2-AP/SM3","Single","EEE"]
[null,null,null,"LIU ZHEN","020820H03","SM3","SM2-AP/SM3","Single","EEE"]
[null,null,null,"XIE JUAN","020822A03","SM2 (Accelerated)","SM2-AP/SM3","Single","EEE"]
[null,null,null,"WANG LEI","020842G03","SM3","SM2-AP/SM3","Single","EEE"]
[null,null,null,"MEI QIUSHENG","020862B03","SM3","SM2-AP/SM3","Single","EEE"]
[null,null,null,"WANG CHAO","020871C03","SM2","SM2-RP","Single","EEE"]
[null,null,null,"DU WEIHONG","020873G03","SM2 (Accelerated)","SM2-AP/SM3","Single","EEE"]
[null,null,null,"SEPTIKA PEDI ARTATI","020878F03","Direct","No bridging","Single","ME"]
[null,null,null,"ADIGUNA TRIMULYONO","020893B03","Direct","No bridging","Single","EEE"]
[null,null,null,"YANG SHAOGUANG","020910J03","SM3","SM2-AP/SM3","Single","EEE"]
[null,null,null,"JIAO ZHENJUN","020911L03","SM3","SM2-AP/SM3","Single","ME"]
[null,null,null,"CHENG ZHENG","020969J03","SM2","SM2-RP","Single","EEE"]
[null,null,null,"ROHIT KRISHNAN","020986J03","Direct","No bridging","Single","EEE"]
[null,null,null,"WANG QIANG","020992D03","SM3","SM2-AP/SM3","Single","EEE"]
[null,null,null,"CAO QI","021011D03","SM3","SM2-AP/SM3","Single","EEE"]
[null,null,null,"LIU FEI","021039D03","SM3","SM2-AP/SM3",{"$f":"VLOOKUP(I$1:I$5281,$A$37:$B$212,2,FALSE)","v":"Single"},"EEE"]
[null,null,null,"YANG YAKUN","021040L03","SM2","SM2-RP","Single","EEE"]
[null,null,null,"ANIRUDH BALIGA","021056D03","Direct","No bridging","Single","EEE"]
[null,null,null,"SHENG ZHENG","021060F03","SM3","SM2-AP/SM3","Single","EEE"]
[null,null,null,"YANG LIMAN","021093K03","SM3","SM2-AP/SM3","Single","EEE"]
[null,null,null,"YUAN CHAO","021097G03","SM3","SM2-AP/SM3","Single","EEE"]
[null,null,null,"WANG RONGJUAN","021126K03","SM2","SM2-RP","Single","EEE"]
[null,null,null,"WU YIDI","021139H03","SM3","SM2-AP/SM3","Single","EEE"]
[null,null,null,"FENG TING","021155F03","MOE PreU Scholar (PRC)","No bridging","Single","EEE"]
[null,null,null,"LI ZONGXU","021159C03","SM2","SM2-RP","Single","EEE"]
[null,null,null,"WANG SHENGXIONG","021162C03","SM3","SM2-AP/SM3","Single","EEE"]
[null,null,null,"ZHAO HAIPING","021163E03","SM3","SM2-AP/SM3","Single","EEE"]
[null,null,null,"GU MAOLIANG","021197L03","SM3","SM2-AP/SM3","Single","CEE"]
[null,null,null,"SUN LINA","021211A03","SM3","SM2-AP/SM3","Single","EEE"]
[null,null,null,"NATTERI MANGADU AADARSH","021223H03","Direct","No bridging","Single","EEE"]
[null,null,null,"WEI LI","021228G03","SM3","SM2-AP/SM3","Single","EEE"]
[null,null,null,"HUANG JIABIN","021231G03","SM3","SM2-AP/SM3","Single","EEE"]
[null,null,null,"CONG YIMIN","021235D03","MOE PreU Scholar (PRC)","No bridging","Single","CEE"]
[null,null,null,"WANG JIAN","021236F03","SM3","SM2-AP/SM3","Single","ME"]
[null,null,null,"LIU NA","021252D03","SM3","SM2-AP/SM3","Single","EEE"]
[null,null,null,"BAI SHUDONG","021261E03","SM3","SM2-AP/SM3","Single","CEE"]
[null,null,null,"REN YAN","021263J03","SM2","SM2-RP","Single","EEE"]
[null,null,null,"ALEXANDER TANZIL","021279B03","Direct","No bridging","Single","EEE"]
[null,null,null,"GUO NING","021283D03","SM3","SM2-AP/SM3","Single","EEE"]
[null,null,null,"CHEN DANDAN","021303F03","SM3","SM2-AP/SM3","Single","EEE"]
[null,null,null,"LUO SHA","021306A03","SM3","SM2-AP/SM3","Single","EEE"]
[null,null,null,"S R HARI HAR SUDAN","021318H03","GCE 'A' Level (S'PORE)","No bridging","Single","EEE"]
[null,null,null,"SRIVARADA KOTA","021320F03","Direct","No bridging","Single","EEE"]
[null,null,null,"DU GUOAN","021325E03","SM3","SM2-AP/SM3","Single","EEE"]
[null,null,null,"MA WENHUI","021326G03","SM2","SM2-RP","Single","EEE"]
[null,null,null,"ZHANG ZHENYU","021336K03","SM3","SM2-AP/SM3","Single","EEE"]
[null,null,null,"HU DEYONG","021345L03","SM3","SM2-AP/SM3","Single","EEE"]
[null,null,null,"YU WEIYANG","021370K03","SM3","SM2-AP/SM3","Single","EEE"]
[null,null,null,"RUAN GANGTAI","021372C03","SM3","SM2-AP/SM3","Single","ME"]
[null,null,null,"MA YONGNING","021374G03","SM2","SM2-RP","Single","EEE"]
[null,null,null,"MANHAR KUMAR","021382F03","Direct","No bridging","Single","EEE"]
[null,null,null,"LIU HONG","021393L03","SM3","SM2-AP/SM3","Single","EEE"]
[null,null,null,"YANG WEI","021422C03","SM3","SM2-AP/SM3","Single","EEE"]
[null,null,null,"LIU YUAN","021430B03","SM2","SM2-RP","Single","ME"]
[null,null,null,"RENDRA SINDUNATA","021497A03","Direct","No bridging","Single","EEE"]
[null,null,null,"PERTAMI JUNIA HAYUNINGTYAS","021502A03","Direct","No bridging","Single","EEE"]
[null,null,null,"JIN FENG","021524L03","MOE PreU Scholar (PRC)","No bridging","Single","EEE"]
[null,null,null,"QU BO","021571J03","SM3","SM2-AP/SM3","Single","EEE"]
[null,null,null,"ANSON HERYANTO","021573B03","Direct","No bridging","Single","EEE"]
[null,null,null,"ZHAO YUAN","021579C03","SM2","SM2-RP","Single","EEE"]
[null,null,null,"TANG SHUYI","021594K03","SM3","SM2-AP/SM3","Single","EEE"]
[null,null,null,"SHEN CHUNWEI","021623B03","SM3","SM2-AP/SM3","Single","ME"]
[null,null,null,"HUANG YOULIANG","021624D03","SM3","SM2-AP/SM3","Single","ME"]
[null,null,null,"ZHANG TAIBAI","021636L03","SM3","SM2-AP/SM3","Single","EEE"]
[null,null,null,"WEI CHENGQING","021640B03","SM2","SM2-RP","Single","EEE"]
[null,null,null,"SHRINIVAS RAMANI","021652J03","Direct","No bridging","Single","EEE"]
[null,null,null,"CHEN LIANG","021662A03","SM3","SM2-AP/SM3","Single","EEE"]
[null,null,null,"XU ZHE","021690F03","SM3","SM2-AP/SM3","Single","EEE"]
[null,null,null,"QIU ZUOLEI","021701G03","SM3","SM2-AP/SM3","Single","CEE"]
[null,null,null,"YOU HONGJUN","021706F03","SM3","SM2-AP/SM3","Single","EEE"]
[null,null,null,"LIU LIBIAO","021708K03","SM3","SM2-AP/SM3","Single","EEE"]
[null,null,null,"WAN CHANGBEN","021719D03","SM3","SM2-AP/SM3","Single","EEE"]
[null,null,null,"MA CHI","021723F03","SM3","SM2-AP/SM3","Single","EEE"]
[null,null,null,"VIPUL KUMAR","021765L03","Direct","No bridging","Single","EEE"]
[null,null,null,"LI BIN","021771F03","SM3","SM2-AP/SM3","Single","EEE"]
[null,null,null,"CHEN QI","021788A03","SM3","SM2-AP/SM3","Single","EEE"]
[null,null,null,"ZHANG MENG","021801L03","SM3","SM2-AP/SM3","Single","EEE"]
[null,null,null,"CUI SHAN","021806K03","SM3","SM2-AP/SM3","Single","EEE"]
[null,null,null,"MA PENGCHUN","021816B03","SM3","SM2-AP/SM3","Single","EEE"]
[null,null,null,"ZHANG XIQIANG","021838A03","SM3","SM2-AP/SM3",{"$f":"VLOOKUP(I$1:I$5281,$A$37:$B$212,2,FALSE)","v":"Single"},"EEE"]
[null,null,null,"LI JIANING","021843E03","SM3","SM2-AP/SM3","Single","EEE"]
[null,null,null,"QUAN LANYING","021845J03","SM3","SM2-AP/SM3","Single","ME"]
[null,null,null,"LI YAN","021873C03","SM2","SM2-RP","Single","EEE"]
[null,null,null,"XU YIFAN","021877L03","SM2","SM2-RP","Single","EEE"]
[null,null,null,"WU YANGYANG","021917H03","SM2","SM2-RP","Single","EEE"]
[null,null,null,"BAI NAN","021919A03","SM3","SM2-AP/SM3","Single","ME"]
[null,null,null,"ZHU LI","021921K03","SM2 (Accelerated)","SM2-AP/SM3","Single","CEE"]
[null,null,null,"LONG HAI","021927L03","SM2","SM2-RP","Single","EEE"]
[null,null,null,"CHEN QI","021954C03","SM3","SM2-AP/SM3","Single","EEE"]
[null,null,null,"XIANG JIANG","021976B03","SM2","SM2-RP","Single","EEE"]
[null,null,null,"LUAN XU","021984A03","SM3","SM2-AP/SM3","Single","EEE"]
[null,null,null,"LUO YING","021997K03","SM3","SM2-AP/SM3","Single","EEE"]
[null,null,null,"SURAJIT GOSWAMI","023001F06","Direct","No bridging","Single","CE"]
[null,null,null,"IRFAN SETIAWAN","023009L06","Direct","No bridging","Single","CE"]
[null,null,null,"OUYANG SHU","023017K06","SM3","SM2-AP/SM3","Single","CE"]
[null,null,null,"ABHINAV AGRAWAL","023018A06","Direct","No bridging","Single","CE"]
[null,null,null,"NEHA MONGA","023020K06","SIA Youth","No bridging","Single","CE"]
[null,null,null,"LIU YUSHENG","023023E06","SM2","SM2-RP","Single","CE"]
[null,null,null,"GUO FENG","023026L06","SM3","SM2-AP/SM3","Single","CE"]
[null,null,null,"PENG XIAOFENG","023060L06","SM2","SM2-RP","Single","CE"]
[null,null,null,"SONALI GOILA","023065K06","SIA Youth","No bridging","Single","CE"]
[null,null,null,"GUO XI","023070C06","SM2","SM2-RP","Single","CE"]
[null,null,null,"ZHANG SHUDONG","023078H06","SM3","SM2-AP/SM3","Single","CE"]
[null,null,null,"LI GANG","023094F06","SM3","SM2-AP/SM3","Single","CE"]
[null,null,null,"JIN JIONG","023107L06","SM3","SM2-AP/SM3","Single","CE"]
[null,null,null,"AN SHU","023109D06","SM3","SM2-AP/SM3","Single","CE"]
[null,null,null,"GENG LIJUAN","023118E06","SM2","SM2-RP","Single","CE"]
[null,null,null,"XIANG JUNJIE","023122G06","SM3","SM2-AP/SM3","Single","CE"]
[null,null,null,"LU FENG","023124L06","SM3","SM2-AP/SM3","Single","CE"]
[null,null,null,"GUO ZHIWEI","023126D06","SM3","SM2-AP/SM3","Single","CE"]
[null,null,null,"TU TONG","023140J06","SM3","SM2-AP/SM3","Single","CE"]
[null,null,null,"GUO JINFU","023141L06","SM2","SM2-RP","Single","CE"]
[null,null,null,"CHEN HUANJIA","023143D06","SM3","SM2-AP/SM3","Single","CE"]
[null,null,null,"ZHANG BAOTONG","023144F06","SM2 (Accelerated)","SM2-AP/SM3","Single","CE"]
[null,null,null,"WANG JIAO","023159H06","SM3","SM2-AP/SM3","Single","CE"]
[null,null,null,"ZHAO FENG","023165C06","SM2 (Accelerated)","SM2-AP/SM3","Single","CE"]
[null,null,null,"RISHI SARASWAT","023166E06","SIA Youth","No bridging","Single","CE"]
[null,null,null,"CHEN CHENG","023190B06","SM3","SM2-AP/SM3","Single","CE"]
[null,null,null,"LI JUN","023193H06","SM2","SM2-RP","Single","CE"]
[null,null,null,"AKSHAY DILIP SARANGDHAR","023208F06","Direct","No bridging","Single","CE"]
[null,null,null,"ZHAO CHANG","023210D06","SM2 (Accelerated)","SM2-AP/SM3","Single","CE"]
[null,null,null,"DAI XINGHANG","023211F06","SM3","SM2-AP/SM3","Single","CE"]
[null,null,null,"TANYA THOMAS","023219L06","SIA Youth","No bridging","Single","CE"]
[null,null,null,"FAUZI MUNIF HASSAN","023221J06","Direct","No bridging","Single","CE"]
[null,null,null,"ZHAO LEI","023229C06","SM2","SM2-RP","Single","CE"]
[null,null,null,"GAO HONGJUN","023231A06","SM3","SM2-AP/SM3","Single","CE"]
[null,null,null,"GUAN WEI","023236L06","SM3","SM2-AP/SM3","Single","CE"]
[null,null,null,"ZHANG QING","023240B06","SM3","SM2-AP/SM3","Single","CE"]
[null,null,null,"ZHANG XUEJIE","023241D06","SM3","SM2-AP/SM3","Single","CE"]
[null,null,null,"HOU BO","023243H06","SM3","SM2-AP/SM3","Single","CE"]
[null,null,null,"MA QINGXIN","023248G06","SM2","SM2-RP","Single","CE"]
[null,null,null,"TANG WEI","023261K06","SM3","SM2-AP/SM3","Single","CE"]
[null,null,null,"VANI ARORA","023265G06","Direct","No bridging","Single","CE"]
[null,null,null,"LIU YONG","023272D06","SM3","SM2-AP/SM3","Single","CE"]
[null,null,null,"HU JIANBO","023295E06","SM3","SM2-AP/SM3","Single","CE"]
[null,null,null,"AVANTI ANIL SAVE","023319D06","SIA Youth","No bridging","Single","CE"]
[null,null,null,"JASLEEN SINGH","023324H06","Direct","No bridging","Single","CE"]
[null,null,null,"YU XUHUI","023342K06","SM2","SM2-RP","Single","CE"]
[null,null,null,"ZHAO GUOPENG","023350J06","SM3","SM2-AP/SM3","Single","CE"]
[null,null,null,"HAN SHUGUO","023354F06","SM3","SM2-AP/SM3","Single","CE"]
[null,null,null,"WU GUODING","023355H06","SM2 (Accelerated)","SM2-AP/SM3","Single","CE"]
[null,null,null,"GAO JUNJIE","023359E06","SM3","SM2-AP/SM3","Single","CE"]
[null,null,null,"LI JIANGGAN","023360A06","SM2","SM2-RP","Single","CE"]
[null,null,null,"SUN YINGLUN","023361C06","MOE PreU Scholar (PRC)","No bridging",{"$f":"VLOOKUP(I$1:I$5281,$A$37:$B$212,2,FALSE)","v":"Single"},"CE"]
[null,null,null,"WANG TING","023383B06","SM2 (Accelerated)","SM2-AP/SM3","Single","CE"]
[null,null,null,"LI ZHE","023396L06","SM2 (Accelerated)","SM2-AP/SM3","Single","CE"]
[null,null,null,"HARSH VARDHAN CHHAPARIA","023400J06","Direct","No bridging","Single","CE"]
[null,null,null,"HANNY YULIUS LIMANTO","023406K06","Direct","No bridging","Single","CE"]
[null,null,null,"MA QIANLI","023413G06","SM3","SM2-AP/SM3","Single","CE"]
[null,null,null,"LIU XIANG","023423K06","SM3","SM2-AP/SM3","Single","CE"]
[null,null,null,"HU MEIQUN","023424A06","SM3","SM2-AP/SM3","Single","CE"]
[null,null,null,"ADITYA MUKHERJEE","023432L06","Direct","No bridging","Single","CE"]
[null,null,null,"SETIA DARMA HANDAJA","023452F06","Direct","No bridging","Single","CE"]
[null,null,null,"CHEN LIYING","023460E06","SM2","SM2-RP","Single","CE"]
[null,null,null,"WANG DONG","023469A06","SM3","SM2-AP/SM3","Single","CE"]
[null,null,null,"SUSSAN DE","023472A06","SIA Youth","No bridging","Single","CE"]
[null,null,null,"MITAWALKAR DHAIRYA KIRAN","023480L06","SIA Youth","No bridging","Single","CE"]
[null,null,null,"WANG JUN","023515D06","SM3","SM2-AP/SM3","Single","CE"]
[null,null,null,"PRIYANKA GUPTA","023518K06","SIA Youth","No bridging","Single","CE"]
[null,null,null,"XU KE","023519A06","SM2","SM2-RP","Single","CE"]
[null,null,null,"SAMEER BAHL","023524E06","Direct","No bridging","Single","CE"]
[null,null,null,"MAYANK AGARWAL","023529D06","Direct","No bridging","Single","CE"]
[null,null,null,"ANKIT BAHRI","023534H06","Direct","No bridging","Single","CE"]
[null,null,null,"BRAMANDIA RAMADHANA","023565H06","Direct","No bridging","Single","CE"]
[null,null,null,"WANG XIN","023568C06","SM2 (Accelerated)","SM2-AP/SM3","Single","CE"]
[null,null,null,"LI XIAOXIAO","023571C06","SM2","SM2-RP","Single","CE"]
[null,null,null,"ZHANG YANLIANG","023572E06","SM2","SM2-RP","Single","CE"]
[null,null,null,"ZHOU YU","023576B06","SM3","SM2-AP/SM3","Single","CE"]
[null,null,null,"ABHINAV GARG","023579H06","SIA Youth","No bridging","Single","CE"]
[null,null,null,"ZHU XIANGFENG","023580D06","SM2 (Accelerated)","SM2-AP/SM3","Single","CE"]
[null,null,null,"LIU DAPENG","023590G06","SM3","SM2-AP/SM3","Single","CE"]
[null,null,null,"QIAO XIAOKE","023592L06","SM3","SM2-AP/SM3","Single","CE"]
[null,null,null,"ZHAO KECHANG","023607F07","SM3","SM2-AP/SM3","Single","MAT"]
[null,null,null,"ZHU ZHU","023611H07","SM2","SM2-RP","Single","MAT"]
[null,null,null,"YANG YING","023616G07","SM2","SM2-RP","Single","MAT"]
[null,null,null,"SHANG XIAOBO","023627A07","SM2","SM2-RP","Single","MAT"]
[null,null,null,"HUANG XIAO","023635L07","SM2","SM2-RP","Single","MAT"]
[null,null,null,"SONG JING","023724K07","SM2","SM2-RP","Single","MAT"]
[null,null,null,"HOU FENG","023744E07","SM2","SM2-RP","Single","MAT"]
[null,null,null,"LU HUI","023755K07","SM2","SM2-RP","Single","MAT"]
[null,null,null,"ZHANG ROU","023762G07","SM2 (Accelerated)","SM2-AP/SM3","Single","MAT"]
[null,null,null,"CHEN XIUYING","023871A07","SM3","SM2-AP/SM3","Single","MAT"]
[null,null,null,"PETER JONATAN","023872C07","Direct","No bridging","Single","MAT"]
[null,null,null,"WANG FEI","023877B07","SM2","SM2-RP","Single","MAT"]
[null,null,null,"PU LINFENG","023888G07","SM3","SM2-AP/SM3","Single","MAT"]
[null,null,null,"QIAN TIANYU","023889J07","SM2","SM2-RP","Single","MAT"]
[null,null,null,"YAO HUASONG","023917K07","SM3","SM2-AP/SM3","Single","MAT"]
[null,null,null,"CAROLINA","023925J07","MOE PreU Scholar (ASEAN)","No bridging","Single","MAT"]
[null,null,null,"YU XI","023935A07","SM3","SM2-AP/SM3","Single","MAT"]
[null,null,null,"ZHANG JINGJING","023949A07","SM2","SM2-RP","Single","MAT"]
[null,null,null,"ZHAO QIAN","024563F04","MOE PreU Scholar (PRC)","No bridging","Single","ACC"]
[null,null,null,"FENG SHU","028040J11","SM3","SM2-AP/SM3","Single","BS"]
[null,null,null,"SHUBHENDRO CHATTERJEE","028110D11","Direct","No bridging","Single","BS"]
[null,null,null,"LUO DAHAI","028127K11","SM3","SM2-AP/SM3","Single","BS"]
[null,null,null,"WANG YU","028148G11","MOE PreU Scholar (PRC)","No bridging","Single","BS"]
[null,null,null,"WAN LIANLIAN","028236D11","SM3","SM2-AP/SM3","Single","BS"]
[null,null,null,"KONG RONG","028238H11","MOE PreU Scholar (PRC)","No bridging","Single","BS"]
[null,null,null,"LIN MIN","028251L11","SM3","SM2-AP/SM3","Single","BS"]
[null,null,null,"LIU LIN","028342C11","SM2 (Accelerated)","SM2-AP/SM3","Single","BS"]
[null,null,null,"XIAO JIE","028353H11","SM2","SM2-RP","Single","BS"]
[null,null,null,"YANG NACHEN","028356C11","SM2 (Accelerated)","SM2-AP/SM3","Single","BS"]
[null,null,null,"SUBHAJEET PARIDA","028399K11","SIA Youth","No bridging","Single","BS"]
[null,null,null,"IGNASIUS ADITYA JAPPAR","028479H11","Direct","No bridging","Single","BS"]
[null,null,null,"WU BIN","028487G11","SM2","SM2-RP","Single","BS"]
[null,null,null,"CHEN YAN","030036H03","SM3","SM2-AP/SM3","Single","EEE"]
[null,null,null,"HE JIANPENG","030059J03","SM3","SM2-AP/SM3","Single","EEE"]
[null,null,null,"Zhang Hao","030069A03","SM3","SM2-AP/SM3","Single","EEE"]
[null,null,null,"AISHIK MUKHOPADHYAY","030070H03","Direct","No bridging",{"$f":"VLOOKUP(I$1:I$5281,$A$37:$B$212,2,FALSE)","v":"Single"},"EEE"]
[null,null,null,"PEI YIYANG","030075G03","SM3","SM2-AP/SM3","Single","EEE"]
[null,null,null,"SHIRVY","030080L03","MOE PreU Scholar (ASEAN)","No bridging","Single","ME"]
[null,null,null,"SHI JINGSHENG","030081B03","SM3","SM2-AP/SM3","Single","BIE"]
[null,null,null,"ZHAO HUI","030084H03","SM3","SM2-AP/SM3","Single","BIE"]
[null,null,null,"CHEN YUN","030088E03","MOE PreU Scholar (PRC)","No bridging","Single","EEE"]
[null,null,null,"JIN ZHE","030109J03","SM2","SM2-RP","Single","EEE"]
[null,null,null,"ZHANG QIONG","030116F03","SM2","SM2-RP","Single","EEE"]
[null,null,null,"ZHAO HANXUE","030118K03","SM3","SM2-AP/SM3","Single","EEE"]
[null,null,null,"LI CHENG","030131B03","SM2","SM2-RP","Single","EEE"]
[null,null,null,"LIU CHANGHUI","030142G03","SM3","SM2-AP/SM3","Single","ENE"]
[null,null,null,"FEI LIYUAN","030146D03","SM3","SM2-AP/SM3","Single","EEE"]
[null,null,null,"FU JIANGXUE","030151H03","SM2","SM2-RP","Single","EEE"]
[null,null,null,"Zhang Liwei","030173G03","SM2","SM2-RP","Single","EEE"]
[null,null,null,"QU TIANGE","030182H03","SM2","SM2-RP","Single","EEE"]
[null,null,null,"AN JIA","030198A03","SM2","SM2-RP","Single","BIE"]
[null,null,null,"HU XING","030199C03","SM3","SM2-AP/SM3","Single","EEE"]
[null,null,null,"SHI LIANG","030208L03","SM2","SM2-RP","Single","CEE"]
[null,null,null,"JIANG YAN","030249C03","MOE PreU Scholar (PRC)","No bridging","Single","BIE"]
[null,null,null,"XIAO LIZHI","030253E03","SM2","SM2-RP","Single","EEE"]
[null,null,null,"YANG WENTAO","030258D03","SM3","SM2-AP/SM3","Single","ME"]
[null,null,null,"MUH FARID ISNAWAN","030261D03","Direct","No bridging","Single","EEE"]
[null,null,null,"ZHU WEI","030288B03","SM2 (Accelerated)","SM2-AP/SM3","Single","EEE"]
[null,null,null,"CHEN DA","030299G03","SM3","SM2-AP/SM3","Single","CEE"]
[null,null,null,"ZHANG CHENGLIANG","030301A03","SM3","SM2-AP/SM3","Single","EEE"]
[null,null,null,"ZHANG LEI","030302C03","SM3","SM2-AP/SM3","Single","EEE"]
[null,null,null,"HUANG WEIPING","030309F03","SM3","SM2-AP/SM3","Single","EEE"]
[null,null,null,"TAO ZUI","030313H03","MOE PreU Scholar (PRC)","No bridging","Single","EEE"]
[null,null,null,"SUBRAMANIUM KARTHIK","030316C03","Direct","No bridging","Single","EEE"]
[null,null,null,"SUN JIN","030329A03","SM2","SM2-RP","Single","ME"]
[null,null,null,"WU TAO","030361H03","SM2","SM2-RP","Single","CEE"]
[null,null,null,"SUN YONGSHUN","030373D03","SM3","SM2-AP/SM3","Single","EEE"]
[null,null,null,"XUE JIANGTAO","030376K03","SM3","SM2-AP/SM3","Single","EEE"]
[null,null,null,"Niu Xiaodun","030406D03","MOE PreU Scholar (PRC)","No bridging","Single","EEE"]
[null,null,null,"WANG YINJIE","030413A03","SM3","SM2-AP/SM3","Single","ENE"]
[null,null,null,"DAI LE","030420J03","SM3","SM2-AP/SM3","Single","EEE"]
[null,null,null,"SHEN YUAN","030433G03","SM3","SM2-AP/SM3","Single","EEE"]
[null,null,null,"GAO YONG","030434J03","SM3","SM2-AP/SM3","Single","EEE"]
[null,null,null,"ANTO BABY","030447G03","SIA Youth","No bridging","Single","EEE"]
[null,null,null,"ZHANG JUANJUAN","030458A03","SM3","SM2-AP/SM3","Single","EEE"]
[null,null,null,"NI WEI","030477E03","SM3","SM2-AP/SM3","Single","EEE"]
[null,null,null,"WANG JING","030478G03","SM3","SM2-AP/SM3","Single","EEE"]
[null,null,null,"TONG KUN","030512C03","MOE PreU Scholar (PRC)","No bridging","Single","EEE"]
[null,null,null,"LIU NING","030550L03","SM2","SM2-RP","Single","BIE"]
[null,null,null,"WU MOQING","030551B03","SM2","SM2-RP","Single","EEE"]
[null,null,null,"CHEN DAN","030556A03","SM2","SM2-RP","Single","EEE"]
[null,null,null,"Zhang Xueyi","030583D03","SM2","SM2-RP","Single","EEE"]
[null,null,null,"LI NIEWEI","030592E03","SM2","SM2-RP","Single","EEE"]
[null,null,null,"RISHIT ROHITKUMAR DESAI","030603F03","SIA Youth","No bridging","Single","EEE"]
[null,null,null,"WANG PENG","030609G03","SM3","SM2-AP/SM3","Single","EEE"]
[null,null,null,"LI HAOYANG","030612G03","SM2 (Accelerated)","SM2-AP/SM3","Single","EEE"]
[null,null,null,"ZHANG HELIANG","030682F03","SM2 (Accelerated)","SM2-AP/SM3","Single","EEE"]
[null,null,null,"SHAO ZAIMING","030706E03","SM3","SM2-AP/SM3","Single","EEE"]
[null,null,null,"YANG YANG","030710G03","MOE PreU Scholar (PRC)","No bridging","Single","EEE"]
[null,null,null,"LI MING","030712L03","SM3","SM2-AP/SM3","Single","EEE"]
[null,null,null,"HU XIAOXIAO","030719C03","SM2","SM2-RP","Single","EEE"]
[null,null,null,"XU MINGYUAN","030731D03","SM2","SM2-RP","Single","EEE"]
[null,null,null,"HUANG JIE","030734K03","MOE PreU Scholar (PRC)","No bridging","Single","BIE"]
[null,null,null,"RISMIYATI","030737E03","Direct","No bridging","Single","EEE"]
[null,null,null,"TRI MARDIYONO","030753C03","Direct","No bridging","Single","EEE"]
[null,null,null,"LI YONGFENG","030776D03","MOE PreU Scholar (PRC)","No bridging","Single","EEE"]
[null,null,null,"LI CONG","030778H03","SM2","SM2-RP","Single","EEE"]
[null,null,null,"HE FEIFEI","030788L03","MOE PreU Scholar (PRC)","No bridging","Single","EEE"]
[null,null,null,"MA LEI","030803C03","SM2","SM2-RP","Single","EEE"]
[null,null,null,"JIN GUOQING","030818E03","SM3","SM2-AP/SM3",{"$f":"VLOOKUP(I$1:I$5281,$A$37:$B$212,2,FALSE)","v":"Single"},"ME"]
[null,null,null,"PAN RENJING","030820C03","SM3","SM2-AP/SM3","Single","EEE"]
[null,null,null,"GOU TING","030823J03","SM2","SM2-RP","Single","EEE"]
[null,null,null,"NING RONGRONG","030828H03","SM3","SM2-AP/SM3","Single","EEE"]
[null,null,null,"ANUJ JAIN","030833A03","Direct","No bridging","Single","EEE"]
[null,null,null,"WU XIA","030855L03","SM3","SM2-AP/SM3","Single","EEE"]
[null,null,null,"Zhang Yi","030863K03","SM2 (Accelerated)","SM2-AP/SM3","Single","BIE"]
[null,null,null,"LIN YU","030865C03","SM3","SM2-AP/SM3","Single","BIE"]
[null,null,null,"LIU CHAO","030867G03","SM2","SM2-RP","Single","EEE"]
[null,null,null,"FEI WEI","030871J03","SM3","SM2-AP/SM3","Single","EEE"]
[null,null,null,"LIU JUAN","030873B03","SM3","SM2-AP/SM3","Single","EEE"]
[null,null,null,"Wang Huasheng","030875F03","SM2","SM2-RP","Single","EEE"]
[null,null,null,"SHI XIAQING","030886L03","SM3","SM2-AP/SM3","Single","EEE"]
[null,null,null,"XU ZHENYU","030889F03","SM3","SM2-AP/SM3","Single","ENE"]
[null,null,null,"ZHANG JIAN","030905L03","SM3","SM2-AP/SM3","Single","EEE"]
[null,null,null,"PENG LI","030909H03","SM3","SM2-AP/SM3","Single","EEE"]
[null,null,null,"SUBKHAN PRAWIRA","030910D03","Direct","No bridging","Single","EEE"]
[null,null,null,"CHEN QITIAN","030912H03","SM3","SM2-AP/SM3","Single","EEE"]
[null,null,null,"Tian Yafei","030916E03","SM3","SM2-AP/SM3","Single","EEE"]
[null,null,null,"ZHANG HONGJIE","030921J03","MOE PreU Scholar (PRC)","No bridging","Single","EEE"]
[null,null,null,"LIU XIAODONG","030929C03","SM3","SM2-AP/SM3","Single","EEE"]
[null,null,null,"LI FEI","030934G03","SM3","SM2-AP/SM3","Single","EEE"]
[null,null,null,"AGUSTIAN TAUFIQ ASYHARI","030943H03","Direct","No bridging","Single","EEE"]
[null,null,null,"FU KAIYUAN","030960H03","SM2","SM2-RP","Single","EEE"]
[null,null,null,"CHEN XIANSHUN","030967L03","MOE PreU Scholar (PRC)","No bridging","Single","EEE"]
[null,null,null,"DAI JINGCHENG","030973F03","SM2","SM2-RP","Single","EEE"]
[null,null,null,"RIYANDI NUSWANTORO","030975K03","Direct","No bridging","Single","ME"]
[null,null,null,"XIONG YUN","030994C03","SM3","SM2-AP/SM3","Single","BIE"]
[null,null,null,"BAI JING","030998L03","SM3","SM2-AP/SM3","Single","BIE"]
[null,null,null,"WANG MIN","031026A03","SM3","SM2-AP/SM3","Single","BIE"]
[null,null,null,"ARPAN DASGUPTA","031035B03","Direct","No bridging","Single","EEE"]
[null,null,null,"SETHI AKSHAY","031072H03","Direct","No bridging","Single","EEE"]
[null,null,null,"WU LIANG","031104F03","SM3","SM2-AP/SM3","Single","BIE"]
[null,null,null,"Li Hao","031106K03","SM2 (Accelerated)","SM2-AP/SM3","Single","BIE"]
[null,null,null,"HUANG YING","031111C03","MOE PreU Scholar (PRC)","No bridging","Single","EEE"]
[null,null,null,"BALASUBRAMANIAN VIKRAM","031116B03","Direct","No bridging","Single","BIE"]
[null,null,null,"CHEN YAHUI","031119H03","MOE PreU Scholar (PRC)","No bridging","Single","ME"]
[null,null,null,"Sun Yujing","031121F03","SM2","SM2-RP","Single","EEE"]
[null,null,null,"CHEN YINGYI","031125C03","SM3","SM2-AP/SM3","Single","EEE"]
[null,null,null,"SUN AHUI","031133B03","SM2","SM2-RP","Single","EEE"]
[null,null,null,"LIU MEIYING","031134D03","SM2","SM2-RP","Single","EEE"]
[null,null,null,"XU WEN","031161G03","SM3","SM2-AP/SM3","Single","EEE"]
[null,null,null,"LIU TIELIANG","031174E03","SM3","SM2-AP/SM3","Single","EEE"]
[null,null,null,"HARYA WICAKSANA","031176J03","Direct","No bridging","Single","EEE"]
[null,null,null,"NEERAJ KUMAR","031177L03","Direct","No bridging","Single","EEE"]
[null,null,null,"Zhou Liting","031182D03","SM3","SM2-AP/SM3","Single","BIE"]
[null,null,null,"QUAN CHENGJI","031259B03","SM3","SM2-AP/SM3","Single","ME"]
[null,null,null,"AJAY K KATTEPUR","031269E03","Direct","No bridging","Single","EEE"]
[null,null,null,"SUN SHAOQING","031279H03","SM2","SM2-RP","Single","EEE"]
[null,null,null,"DONG KAIKAI","031289L03","SM3","SM2-AP/SM3","Single","EEE"]
[null,null,null,"ZHAO CHEN","031301H03","SM2","SM2-RP","Single","EEE"]
[null,null,null,"AN AN","031307J03","SM3","SM2-AP/SM3","Single","BIE"]
[null,null,null,"WANG YUE","031312B03","SM2","SM2-RP","Single","ENE"]
[null,null,null,"ZHANG XIANG","031328F03","SM3","SM2-AP/SM3","Single","EEE"]
[null,null,null,"SUN TAO","031338J03","SM2","SM2-RP","Single","EEE"]
[null,null,null,"CHE CHUNGUANG","031386J03","SM3","SM2-AP/SM3","Single","EEE"]
[null,null,null,"Tang Lin","031411D03","SM2 (Accelerated)","SM2-AP/SM3","Single","EEE"]
[null,null,null,"CHEN YOULIANG","031445K03","MOE PreU Scholar (PRC)","No bridging","Single","EEE"]
[null,null,null,"ZHANG LIN","031448E03","SM2","SM2-RP","Single","EEE"]
[null,null,null,"ZHOU XINTAO","031464C03","SM3","SM2-AP/SM3","Single","EEE"]
[null,null,null,"WANG ZHIYUAN","031465E03","SM3","SM2-AP/SM3","Single","EEE"]
[null,null,null,"WANG SISONG","031475H03","SM3","SM2-AP/SM3","Single","EEE"]
[null,null,null,"ZHU GUOJUN","031483G03","SM3","SM2-AP/SM3","Single","EEE"]
[null,null,null,"ZHOU YUAN","031485L03","SM3","SM2-AP/SM3","Single","EEE"]
[null,null,null,"KUNAL MUKHERJEE","031518L03","Direct","No bridging",{"$f":"VLOOKUP(I$1:I$5281,$A$37:$B$212,2,FALSE)","v":"Single"},"EEE"]
[null,null,null,"JASON BEVIS NORONHA","031519B03","Direct","No bridging","Single","EEE"]
[null,null,null,"ZHANG JUNBIN","031562C03","SM3","SM2-AP/SM3","Single","EEE"]
[null,null,null,"LI QING","031573H03","SM2","SM2-RP","Single","EEE"]
[null,null,null,"LIU DAN","031598B03","SM3","SM2-AP/SM3","Single","ME"]
[null,null,null,"LI DONGWEI","031625A03","SM3","SM2-AP/SM3","Single","EEE"]
[null,null,null,"ZHANG YUXIANG","031635D03","SM2 (Accelerated)","SM2-AP/SM3","Single","EEE"]
[null,null,null,"ZHU SHU","031639A03","SM2","SM2-RP","Single","EEE"]
[null,null,null,"DU WEICHAO","031643C03","MOE PreU Scholar (PRC)","No bridging","Single","EEE"]
[null,null,null,"JIANG OU","031648B03","SM2","SM2-RP","Single","ME"]
[null,null,null,"JOHN PRIYADI","031650L03","Direct","No bridging","Single","ME"]
[null,null,null,"LIAO KAI","031651B03","SM3","SM2-AP/SM3","Single","ENE"]
[null,null,null,"ASHWINI KUMAR SAHU","031652D03","Direct","No bridging","Single","EEE"]
[null,null,null,"RAMADAS SRINIVAS","031653F03","Direct","No bridging","Single","EEE"]
[null,null,null,"LI YAXING","031664L03","SM2","SM2-RP","Single","EEE"]
[null,null,null,"XU XIN","031685H03","SM2","SM2-RP","Single","EEE"]
[null,null,null,"CUI GUANGDA","031698F03","SM2","SM2-RP","Single","EEE"]
[null,null,null,"FENG LIN","031705K03","SM3","SM2-AP/SM3","Single","EEE"]
[null,null,null,"WEI HAN","031721H03","SM3","SM2-AP/SM3","Single","EEE"]
[null,null,null,"Zhong Tian","031730J03","SM2 (Accelerated)","SM2-AP/SM3","Single","EEE"]
[null,null,null,"ROMIT DAS","031734F03","Direct","No bridging","Single","EEE"]
[null,null,null,"CAO ZIKE","031739E03","SM2","SM2-RP","Single","EEE"]
[null,null,null,"LIANG HOUKUN","031747D03","SM3","SM2-AP/SM3","Single","EEE"]
[null,null,null,"BABANG PUTRA PARHUSIP","031750D03","Direct","No bridging","Single","EEE"]
[null,null,null,"GUO CHUNXIAN","031754A03","SM3","SM2-AP/SM3","Single","BIE"]
[null,null,null,"Yi He","031759L03","SM3","SM2-AP/SM3","Single","EEE"]
[null,null,null,"AMBER JALAN","031788G03","Direct","No bridging","Single","ME"]
[null,null,null,"CAI WEIYU","031793L03","SM3","SM2-AP/SM3","Single","BIE"]
[null,null,null,"CHENG XIJIE","031794B03","SM2","SM2-RP","Single","ME"]
[null,null,null,"MAO XIAOHONG","031798K03","SM3","SM2-AP/SM3","Single","EEE"]
[null,null,null,"LI NING","031820K03","SM2","SM2-RP","Single","ENE"]
[null,null,null,"PEI TIANRUI","031841G03","SM3","SM2-AP/SM3","Single","ME"]
[null,null,null,"KAUSHIK RAMAKRISHNAN","031853C03","Direct","No bridging","Single","EEE"]
[null,null,null,"LIU JUNLIAN","031860L03","SM2 (Accelerated)","SM2-AP/SM3","Single","EEE"]
[null,null,null,"GAO XIN","031871E03","SM3","SM2-AP/SM3","Single","BIE"]
[null,null,null,"JIANG LINA","031876D03","SM2","SM2-RP","Single","EEE"]
[null,null,null,"HUANG YUEXIANG","031881H03","SM3","SM2-AP/SM3","Single","ME"]
[null,null,null,"Yang Site","031882K03","SM3","SM2-AP/SM3","Single","BIE"]
[null,null,null,"RIA ANGGRIANI","031884C03","Direct","No bridging","Single","EEE"]
[null,null,null,"JAGDISH TRIPATHY","031888L03","Direct","No bridging","Single","BIE"]
[null,null,null,"QU BOYANG","031904E03","SM3","SM2-AP/SM3","Single","EEE"]
[null,null,null,"KOPPA VIJETHA","031909D03","Direct","No bridging","Single","EEE"]
[null,null,null,"SHAN HONGLEI","031918E03","SM3","SM2-AP/SM3","Single","ME"]
[null,null,null,"LIAO JIE","031930F03","SM3","SM2-AP/SM3","Single","EEE"]
[null,null,null,"PENG LAN","031933A03","SM2","SM2-RP","Single","EEE"]
[null,null,null,"KRISHNAN BHARADWAJ","031935E03","Direct","No bridging","Single","EEE"]
[null,null,null,"FENG JUNJIE","031938L03","SM3","SM2-AP/SM3","Single","EEE"]
[null,null,null,"CHU HONGGANG","031951C03","SM3","SM2-AP/SM3","Single","EEE"]
[null,null,null,"CHEN JIAN","031952E03","MOE PreU Scholar (PRC)","No bridging","Single","EEE"]
[null,null,null,"NITIN BHARATHY","031959H03","Direct","No bridging","Single","EEE"]
[null,null,null,"TIAN FANGRUI","031967G03","SM2","SM2-RP","Single","EEE"]
[null,null,null,"WANG JIHAI","031977K03","SM3","SM2-AP/SM3","Single","EEE"]
[null,null,null,"YIN LU","031992F03","SM2","SM2-RP","Single","BIE"]
[null,null,null,"HUA XIA","031994K03","SM2 (Accelerated)","SM2-AP/SM3","Single","EEE"]
[null,null,null,"PU GUANNAN","033017E06","SM3","SM2-AP/SM3","Single","CE"]
[null,null,null,"JOY KAUSHISH","033028K06","Direct","No bridging","Single","CE"]
[null,null,null,"Vineet Khattar","033031K06","Direct","No bridging","Single","CE"]
[null,null,null,"HAZRAT PRADIPTA RANJALI","033039D06","Direct","No bridging","Single","CE"]
[null,null,null,"RAM GOPALAKRISHNAN","033040L06","Direct","No bridging","Single","CE"]
[null,null,null,"HUANG WEI","033043F06","SM3","SM2-AP/SM3","Single","CE"]
[null,null,null,"ZHU NING","033062K06","SM3","SM2-AP/SM3","Single","CE"]
[null,null,null,"YAO SHUO","033071L06","MOE PreU Scholar (PRC)","No bridging","Single","CE"]
[null,null,null,"MIAO LIQIANG","033077A06","SM3","SM2-AP/SM3","Single","CE"]
[null,null,null,"JIA CHENJUN","033085L06","SM2","SM2-RP","Single","CE"]
[null,null,null,"ZHANG QIUSHI","033087D06","SM2 (Accelerated)","SM2-AP/SM3",{"$f":"VLOOKUP(I$1:I$5281,$A$37:$B$212,2,FALSE)","v":"Single"},"CE"]
[null,null,null,"LIANG YUXI","033094A06","SM3","SM2-AP/SM3","Single","CE"]
[null,null,null,"PRAGYAN PARAMITA SAHOO","033096E06","Direct","No bridging","Single","CE"]
[null,null,null,"WEI LEI","033100C06","SM3","SM2-AP/SM3","Single","CE"]
[null,null,null,"WANG ZHILIN","033108H06","SM3","SM2-AP/SM3","Single","CE"]
[null,null,null,"LI WEN","033111H06","SM2","SM2-RP","Single","CE"]
[null,null,null,"HUANG HE","033115E06","SM2","SM2-RP","Single","CE"]
[null,null,null,"YU HAN","033118L06","MOE PreU Scholar (PRC)","No bridging","Single","CE"]
[null,null,null,"HUANG TINGFANG","033120J06","MOE PreU Scholar (PRC)","No bridging","Single","CE"]
[null,null,null,"ZHAO HONG","033130A06","MOE PreU Scholar (PRC)","No bridging","Single","CE"]
[null,null,null,"QIN BING","033133G06","SM3","SM2-AP/SM3","Single","CE"]
[null,null,null,"WENG KAIBIN","033148J06","MOE PreU Scholar (PRC)","No bridging","Single","CE"]
[null,null,null,"Sidharth Subramanian","033157K06","Direct","No bridging","Single","CE"]
[null,null,null,"LIU WEIJIE","033165J06","SM2","SM2-RP","Single","CE"]
[null,null,null,"LI ZHENGHUA","033167B06","SM3","SM2-AP/SM3","Single","CE"]
[null,null,null,"LI BINBIN","033201J06","SM3","SM2-AP/SM3","Single","CE"]
[null,null,null,"Ye Wenjie","033204D06","SM3","SM2-AP/SM3","Single","CE"]
[null,null,null,"WANG HAO","033210K06","SM3","SM2-AP/SM3","Single","CE"]
[null,null,null,"WANG HAIXIA","033222F06","SM3","SM2-AP/SM3","Single","CE"]
[null,null,null,"WANG JINHUI","033230E06","SM3","SM2-AP/SM3","Single","CE"]
[null,null,null,"LIU WEI","033234B06","SM2","SM2-RP","Single","CE"]
[null,null,null,"TU XIAOYING","033237H06","SM2 (Accelerated)","SM2-AP/SM3","Single","CE"]
[null,null,null,"QI YONG","033241K06","SM2","SM2-RP","Single","CE"]
[null,null,null,"Wang Wei","033243C06","SM3","SM2-AP/SM3","Single","CE"]
[null,null,null,"CHEN LIN","033244E06","SM2 (Accelerated)","SM2-AP/SM3","Single","CE"]
[null,null,null,"AKHIL JAIN","033245G06","Direct","No bridging","Single","CE"]
[null,null,null,"LIU YANG","033259G06","SM3","SM2-AP/SM3","Single","CE"]
[null,null,null,"WANG XIN","033265B06","SM2","SM2-RP","Single","CE"]
[null,null,null,"Xie Boya","033282B06","SM2 (Accelerated)","SM2-AP/SM3","Single","CE"]
[null,null,null,"KARLINA","033288C06","Direct","No bridging","Single","CE"]
[null,null,null,"ARFIKA NURHUDATIANA","033291C06","Direct","No bridging","Single","CE"]
[null,null,null,"Jia ShaoPeng","033295L06","SM2","SM2-RP","Single","CE"]
[null,null,null,"Sun Chao","033296B06","SM3","SM2-AP/SM3","Single","CE"]
[null,null,null,"NIU JUNPENG","033300L06","SM3","SM2-AP/SM3","Single","CE"]
[null,null,null,"LAKHTAKIA ARJUN","033303F06","Direct","No bridging","Single","CE"]
[null,null,null,"MUCHAMAD CHOZINUL AMRI","033316D06","Direct","No bridging","Single","CE"]
[null,null,null,"GUO JIAN","033320F06","SM3","SM2-AP/SM3","Single","CE"]
[null,null,null,"SONG YEFEI","033328L06","SM2","SM2-RP","Single","CE"]
[null,null,null,"YU YANG","033339E06","SM2","SM2-RP","Single","CE"]
[null,null,null,"WU ZHANGWEI","033340A06","SM3","SM2-AP/SM3","Single","CE"]
[null,null,null,"MA YUNING","033341C06","SM3","SM2-AP/SM3","Single","CE"]
[null,null,null,"MANISH RAI JAIN","033364D06","Direct","No bridging","Single","CE"]
[null,null,null,"WEN SHUO","033366H06","SM3","SM2-AP/SM3","Single","CE"]
[null,null,null,"DAI XIAOMING","033375J06","SM3","SM2-AP/SM3","Single","CE"]
[null,null,null,"LU XIN","033386C06","SM2","SM2-RP","Single","CE"]
[null,null,null,"HU NAN","033397H06","SM3","SM2-AP/SM3","Single","CE"]
[null,null,null,"ROCHAK AGRAWAL","033400D06","Direct","No bridging","Single","CE"]
[null,null,null,"WEN JING","033402H06","SM3","SM2-AP/SM3","Single","CE"]
[null,null,null,"ARINTO MURDOPO","033410G06","Direct","No bridging","Single","CE"]
[null,null,null,"KARNIKA MISRA","033419C06","Direct","No bridging","Single","CE"]
[null,null,null,"Wu Bo","033429F06","SM3","SM2-AP/SM3","Single","CE"]
[null,null,null,"Zhou Yong","033436C06","SM3","SM2-AP/SM3","Single","CE"]
[null,null,null,"YANG YIFAN","033438G06","SM3","SM2-AP/SM3","Single","CE"]
[null,null,null,"ZHAO DAWEI","033444B06","SM2","SM2-RP","Single","CE"]
[null,null,null,"KUMAR ANKUR","033456J06","Direct","No bridging","Single","CE"]
[null,null,null,"PAN TAN","033460L06","SM3","SM2-AP/SM3","Single","CE"]
[null,null,null,"APOORV BANSAL","033465K06","Direct","No bridging","Single","CE"]
[null,null,null,"WU ZHENGNING","033472G06","SM3","SM2-AP/SM3","Single","CE"]
[null,null,null,"WANG YANWEN","033475B06","SM2","SM2-RP","Single","CE"]
[null,null,null,"SAHIL AGGARWAL","033480F06","Direct","No bridging","Single","CE"]
[null,null,null,"MEGAWATI SANTOSO BUDIARDJO","033488L06","Direct","No bridging","Single","CE"]
[null,null,null,"CHEN CHUAN","033489B06","SM3","SM2-AP/SM3","Single","CE"]
[null,null,null,"WANG GENG","033491L06","SM3","SM2-AP/SM3","Single","CE"]
[null,null,null,"GU WENBIN","033494F06","SM3","SM2-AP/SM3","Single","CE"]
[null,null,null,"ZHENG JIE","033495H06","SM3","SM2-AP/SM3",{"$f":"VLOOKUP(I$1:I$5281,$A$37:$B$212,2,FALSE)","v":"Single"},"CE"]
[null,null,null,"SETU SWETANK","033498C06","SIA Youth","No bridging","Single","CE"]
[null,null,null,"SHEN XIAOYU","033500H06","SM2","SM2-RP","Single","CE"]
[null,null,null,"LIU XIAOYU","033508B06","SM2","SM2-RP","Single","CE"]
[null,null,null,"LI ZIJIA","033526D06","SM3","SM2-AP/SM3","Single","CE"]
[null,null,null,"LIN DAPENG","033529K06","SM3","SM2-AP/SM3","Single","CE"]
[null,null,null,"WANG KAI","033530F06","SM3","SM2-AP/SM3","Single","CE"]
[null,null,null,"DING LING","033534C06","SM2","SM2-RP","Single","CE"]
[null,null,null,"YI SUHUANG","033538L06","SM3","SM2-AP/SM3","Single","CE"]
[null,null,null,"Sun Hong Mei","033540J06","SM3","SM2-AP/SM3","Single","CE"]
[null,null,null,"TAO LIN","033543D06","SM3","SM2-AP/SM3","Single","CE"]
[null,null,null,"ARIE HANS NASUTION","033545H06","Direct","No bridging","Single","CE"]
[null,null,null,"LI QIAOYANG","033557D06","SM3","SM2-AP/SM3","Single","CE"]
[null,null,null,"SRINIVASAN PRIYA","033571J06","SIA Youth","No bridging","Single","CE"]
[null,null,null,"DHANI WIRYAWAN SUSILO","033573B06","Direct","No bridging","Single","CE"]
[null,null,null,"FAN QU","033579C06","SM3","SM2-AP/SM3","Single","CE"]
[null,null,null,"AN LE","033586L06","SM3","SM2-AP/SM3","Single","CE"]
[null,null,null,"SU KAIPENG","033587B06","SM3","SM2-AP/SM3","Single","CE"]
[null,null,null,"ZHANG JIAN","033592F06","SM3","SM2-AP/SM3","Single","CE"]
[null,null,null,"GUO JIAN","033593H06","SM3","SM2-AP/SM3","Single","CE"]
[null,null,null,"ZHENG HUAIYU","033594K06","SM3","SM2-AP/SM3","Single","CE"]
[null,null,null,"WANG ZONGBIN","033604F07","SM3","SM2-AP/SM3","Single","MAT"]
[null,null,null,"ZHANG YU","033624A07","SM2","SM2-RP","Single","MAT"]
[null,null,null,"Xie Ye","033643E07","SM3","SM2-AP/SM3","Single","MAT"]
[null,null,null,"ZHAO TING","033650B07","SM3","SM2-AP/SM3","Single","MAT"]
[null,null,null,"CHEN ZHENXI","033651D07","SM3","SM2-AP/SM3","Single","MAT"]
[null,null,null,"WANG JIE","033658G07","SM2","SM2-RP","Single","MAT"]
[null,null,null,"INTAN AYU PERWITASARI","033661G07","Direct","No bridging","Single","MAT"]
[null,null,null,"ZHOU WENWEN","033669A07","SM2","SM2-RP","Single","MAT"]
[null,null,null,"HE SU","033672A07","SM2","SM2-RP","Single","MAT"]
[null,null,null,"WEI XIAOHONG","033681B07","SM3","SM2-AP/SM3","Single","MAT"]
[null,null,null,"LIU SIRUI","033691E07","SM2","SM2-RP","Single","MAT"]
[null,null,null,"Zhang Ji","033715D07","SM2","SM2-RP","Single","MAT"]
[null,null,null,"LI LI","033729D07","SM2","SM2-RP","Single","MAT"]
[null,null,null,"Yu Jian","033730L07","SM3","SM2-AP/SM3","Single","MAT"]
[null,null,null,"LIU FENG","033774J07","SM3","SM2-AP/SM3","Single","MAT"]
[null,null,null,"YU WEI","033775L07","SM3","SM2-AP/SM3","Single","MAT"]
[null,null,null,"DU LEI","033785C07","SM3","SM2-AP/SM3","Single","MAT"]
[null,null,null,"YU YUE","033786E07","SM3","SM2-AP/SM3","Single","MAT"]
[null,null,null,"JIANG YINUO","033792L07","SM3","SM2-AP/SM3","Single","MAT"]
[null,null,null,"HANKY BAYUGIRI TAUFAN GURUH","033796H07","Direct","No bridging","Single","MAT"]
[null,null,null,"MEI GE","033802K07","SM2","SM2-RP","Single","MAT"]
[null,null,null,"AN TAO","033813D07","MOE PreU Scholar (PRC)","No bridging","Single","MAT"]
[null,null,null,"LI XIN","033820A07","SM2","SM2-RP","Single","MAT"]
[null,null,null,"DING CHANGJIANG","033826B07","MOE PreU Scholar (PRC)","No bridging","Single","MAT"]
[null,null,null,"LI GUANG","033867E07","MOE PreU Scholar (PRC)","No bridging","Single","MAT"]
[null,null,null,"WANG JING","033910B07","SM2","SM2-RP","Single","MAT"]
[null,null,null,"CHEN TAOTAO","033923L07","SM2 (Accelerated)","SM2-AP/SM3","Single","MAT"]
[null,null,null,"ZHANG PENG","033925D07","SM2","SM2-RP","Single","MAT"]
[null,null,null,"TIAN YUTIAN","033938B07","SM2","SM2-RP","Single","MAT"]
[null,null,null,"PENG YAN","033942D07","SM2","SM2-RP","Single","MAT"]
[null,null,null,"SHEN YANFU/SHEN JIANGANG","038012K11","SM3","SM2-AP/SM3","Single","BS"]
[null,null,null,"Wang Xueqian","038069F11","SM2 (Accelerated)","SM2-AP/SM3","Single","BS"]
[null,null,null,"ANDRE BUDI PERWIRA BIN BASNI","038073H11","Sembcorp","No bridging","Single","BS"]
[null,null,null,"WU YULEI","038077E11","MOE PreU Scholar (PRC)","No bridging","Single","BS"]
[null,null,null,"ZHANG YING","038091K11","SM2 (Accelerated)","SM2-AP/SM3","Single","BS"]
[null,null,null,"WU ZHIHAO","038142A11","SM3","SM2-AP/SM3","Single","BS"]
[null,null,null,"DENG LIANGHUA","038173A11","SM3","SM2-AP/SM3","Single","BS"]
[null,null,null,"ZHENG SHICHUN","038175E11","SM3","SM2-AP/SM3","Single","BS"]
[null,null,null,"FENG TAO","038185H11","SM2","SM2-RP","Single","BS"]
[null,null,null,"YU HANG","038204H11","SM2 (Accelerated)","SM2-AP/SM3","Single","BS"]
[null,null,null,"CHEN DI","038221H11","SM2","SM2-RP","Single","BS"]
[null,null,null,"LU CHENNING","038272C11","SM2","SM2-RP","Single","BS"]
[null,null,null,"BRIGITTA DEWI WASTUWIDYANINGTYAS","038274G11","Direct","No bridging","Single","BS"]
[null,null,null,"LI YING","038279F11","SM2","SM2-RP",{"$f":"VLOOKUP(I$1:I$5281,$A$37:$B$212,2,FALSE)","v":"Single"},"BS"]
[null,null,null,"WEI LEI","038296F11","SM3","SM2-AP/SM3","Single","BS"]
[null,null,null,"WENG JIE","038344B11","MOE PreU Scholar (PRC)","No bridging","Single","BS"]
[null,null,null,"XING XING","038346F11","SM3","SM2-AP/SM3","Single","BS"]
[null,null,null,"YANG RENLIANG","038347H11","SM3","SM2-AP/SM3","Single","BS"]
[null,null,null,"RAJASHREE SRINIVASAN","040067C03","Direct","No bridging","Single","BIE"]
[null,null,null,"ZHENG XINTING","040073J03","MOE PreU Scholar (PRC)","No bridging","Single","BIE"]
[null,null,null,"PRANEETH NAMBURI","040094F03","Direct","No bridging","Single","EEE"]
[null,null,null,"Lilyana Budyanto","040109D03","Direct","No bridging","Single","BIE"]
[null,null,null,"ZHENG YONGMIAN","040178A03","MOE PreU Scholar (PRC)","No bridging","Single","EEE"]
[null,null,null,"SALONY KAPUR","040295E03","Direct","No bridging","Single","EEE"]
[null,null,null,"DONI HANAFI","040347J03","Direct","No bridging","Single","EEE"]
[null,null,null,"SREEJITH BALAKRISHNAN","040371F03","SIA Youth","No bridging","Single","EEE"]
[null,null,null,"RAHMAT DARANI GUOTAMA","040389C03","Sembcorp","No bridging","Single","BIE"]
[null,null,null,"LISSIANA MARKUN LAUWA","040403D03","Direct","No bridging","Single","ENE"]
[null,null,null,"SRINIDHI MANJUNATHA","040404F03","Direct","No bridging","Single","EEE"]
[null,null,null,"RAYMOND JONATHAN HERTANTO","040440K03","Direct","No bridging","Single","ME"]
[null,null,null,"AMANPREET SINGH","040493J03","SIA Youth","No bridging","Single","BIE"]
[null,null,null,"TOMY RUSLI HO","040550F03","Direct","No bridging","Single","ME"]
[null,null,null,"MITALI KAKRAN","040576B03","Direct","No bridging","Single","BIE"]
[null,null,null,"NATTERI MANGADU VARUN","040579H03","Direct","No bridging","Single","EEE"]
[null,null,null,"ANANTHAKRISHNAN PRASHANTH ANANTH","040585C03","SIA-NOL","No bridging","Single","EEE"]
[null,null,null,"YANG YANG","040636E03","MOE PreU Scholar (PRC)","No bridging","Single","EEE"]
[null,null,null,"SAHIL WADHWA","040806D03","Direct","No bridging","Single","ME"]
[null,null,null,"Nanis Sakti Ningrum","040827A03","Direct","No bridging","Single","ENE"]
[null,null,null,"ISKANDARSYAH","040867B03","Direct","No bridging","Single","EEE"]
[null,null,null,"BENNY ARDI PANDOWO","040919F03","Direct","No bridging","Single","ME"]
[null,null,null,"SUMIT KHEMANI","040971H03","SIA Youth","No bridging","Single","EEE"]
[null,null,null,"Kalyanaraman Vivek Kumar","040985H03","Direct","No bridging","Single","EEE"]
[null,null,null,"TANG HAITAO","040998F03","SM3","SM2-AP/SM3","Single","EEE"]
[null,null,null,"YU WENFENG","041108J03","MOE PreU Scholar (PRC)","No bridging","Single","EEE"]
[null,null,null,"MUHAMMAD ZUHDI","041148K03","Direct","No bridging","Single","EEE"]
[null,null,null,"AVINAASH RAVI","041260D03","Direct","No bridging","Single","EEE"]
[null,null,null,"AMITOJ SAINI","041476E03","Direct","No bridging","Single","EEE"]
[null,null,null,"VARUN ANIL DESOUSA","041516B03","SIA Youth","No bridging","Single","ME"]
[null,null,null,"Pankaj Agarwal","041527G03","Direct","No bridging","Single","EEE"]
[null,null,null,"RADON DHELIKA","041545J03","Direct","No bridging","Single","EEE"]
[null,null,null,"LUO XIAODONG","041568K03","SM3","SM2-AP/SM3","Single","EEE"]
[null,null,null,"FENG TESHU","041713D03","MOE PreU Scholar (PRC)","No bridging","Single","EEE"]
[null,null,null,"CHRISTIE PRAJITNO","041731F03","Direct","No bridging","Single","ENE"]
[null,null,null,"JOEKU JOSEPH TOM","041946E03","Direct","No bridging","Single","EEE"]
[null,null,null,"RUWADI","041992A03","Direct","No bridging","Single","ME"]
[null,null,null,"Kunal Agarwal","043015G06","Direct","No bridging","Single","CE"]
[null,null,null,"CAI XIAOCHONG","043018B06","SM3","SM2-AP/SM3","Single","CE"]
[null,null,null,"Liang Yuanxi","043020L06","SM3","SM2-AP/SM3","Single","CE"]
[null,null,null,"YANG FAN","043026A06","SM3","SM2-AP/SM3","Single","CE"]
[null,null,null,"CHENG ZHIGAO","043027C06","SM3","SM2-AP/SM3","Single","CE"]
[null,null,null,"LI BOYANG","043056K06","SM2","SM2-RP","Single","CE"]
[null,null,null,"DAI HUA","043065L06","SM2","SM2-RP","Single","CE"]
[null,null,null,"GUO XINQING","043088A06","SM3","SM2-AP/SM3","Single","CE"]
[null,null,null,"XUE LEI","043089C06","SM3","SM2-AP/SM3","Single","CE"]
[null,null,null,"LI WEI","043102B06","SM3","SM2-AP/SM3","Single","CE"]
[null,null,null,"ZHANG KUAN","043117D06","SM3","SM2-AP/SM3","Single","CE"]
[null,null,null,"I WAYAN TRESNA PERDANA","043125C06","Direct","No bridging","Single","CE"]
[null,null,null,"ARIEF HIDAYAT","043128J06","Direct","No bridging","Single","CE"]
[null,null,null,"Lin Lin","043130G06","SM3","SM2-AP/SM3","Single","CE"]
[null,null,null,"ZHANG YANSHAN","043147B06","SM3","SM2-AP/SM3","Single","CE"]
[null,null,null,"BAI YUNFEI","043161G06","SM3","SM2-AP/SM3","Single","CE"]
[null,null,null,"NING ZEYU","043165D06","SM3","SM2-AP/SM3","Single","CE"]
[null,null,null,"AAYUSH SINGHANIA","043170H06","Direct","No bridging","Single","CE"]
[null,null,null,"WANG WEI","043171K06","SM3","SM2-AP/SM3","Single","CE"]
[null,null,null,"WU JIANG","043173C06","SM3","SM2-AP/SM3","Single","CE"]
[null,null,null,"LIANG PEIYUAN","043180L06","SM3","SM2-AP/SM3","Single","CE"]
[null,null,null,"HUANG XIN","043184H06","SM2","SM2-RP","Single","CE"]
[null,null,null,"KANIKA JAIN","043185K06","Direct","No bridging",{"$f":"VLOOKUP(I$1:I$5281,$A$37:$B$212,2,FALSE)","v":"Single"},"CE"]
[null,null,null,"AVISHEK GHOSH","043236A06","Direct","No bridging","Single","CE"]
[null,null,null,"CHENG KANG","043245B06","SM2","SM2-RP","Single","CE"]
[null,null,null,"PRIYANKA GANJOO","043280D06","Direct","No bridging","Single","CE"]
[null,null,null,"HE RUJING","043286E06","SM3","SM2-AP/SM3","Single","CE"]
[null,null,null,"Zhao Xiaolin","043300F06","SM3","SM2-AP/SM3","Single","CE"]
[null,null,null,"Wang Wei","043338J06","SM3","SM2-AP/SM3","Single","CE"]
[null,null,null,"CAI YI","043352C06","SM3","SM2-AP/SM3","Single","CE"]
[null,null,null,"TAO YING","043366C06","SM3","SM2-AP/SM3","Single","CE"]
[null,null,null,"Prachi Sharma","043387L06","Direct","No bridging","Single","CE"]
[null,null,null,"Tao Jun","043430H06","SM2","SM2-RP","Single","CE"]
[null,null,null,"HU ZHI","043438B06","SM3","SM2-AP/SM3","Single","CE"]
[null,null,null,"LI FENGZHI","043446A06","SM3","SM2-AP/SM3","Single","CE"]
[null,null,null,"PRAKASH MEENAL","043448E06","Direct","No bridging","Single","CE"]
[null,null,null,"CHEN XI","043449G06","SM2 (Accelerated)","SM2-AP/SM3","Single","CE"]
[null,null,null,"CAO MIN","043451E06","SM3","SM2-AP/SM3","Single","CE"]
[null,null,null,"IBRAHIM NELMAN LUBIS","043471L06","Direct","No bridging","Single","CE"]
[null,null,null,"VENNY KARLINA GUNAWAN","043493K06","Direct","No bridging","Single","CE"]
[null,null,null,"Japjit Singh Ghai","043495C06","Direct","No bridging","Single","CE"]
[null,null,null,"LIN MENGDA","043516G06","SM2 (Accelerated)","SM2-AP/SM3","Single","CE"]
[null,null,null,"BAI XIAOGUANG","043520J06","SM2","SM2-RP","Single","CE"]
[null,null,null,"DEVAYAN MALLICK","043525H06","Direct","No bridging","Single","CE"]
[null,null,null,"CHEN SHANGYU","043536B06","SM3","SM2-AP/SM3","Single","CE"]
[null,null,null,"JIA LEI","043550G06","SM3","SM2-AP/SM3","Single","CE"]
[null,null,null,"ASEEM BRAHMA","043564G06","Direct","No bridging","Single","CE"]
[null,null,null,"ZHOU JING","043567B06","SM2","SM2-RP","Single","CE"]
[null,null,null,"ZHENG PENG","043598B06","SM2","SM2-RP","Single","CE"]
[null,null,null,"WEI FENGXIA","043612L07","SM3","SM2-AP/SM3","Single","MAT"]
[null,null,null,"HUANG WEI","043644B07","SM3","SM2-AP/SM3","Single","MAT"]
[null,null,null,"LI HENAN","043672G07","SM2 (Accelerated)","SM2-AP/SM3","Single","MAT"]
[null,null,null,"Aulia Tegar Wicaksono","043686G07","Direct","No bridging","Single","MAT"]
[null,null,null,"WU SHIXIN","043690J07","SM2","SM2-RP","Single","MAT"]
[null,null,null,"SHI YA","043708B07","SM2","SM2-RP","Single","MAT"]
[null,null,null,"Li YongJia","043717C07","SM2","SM2-RP","Single","MAT"]
[null,null,null,"HE MINGGUANG","043735E07","SM3","SM2-AP/SM3","Single","MAT"]
[null,null,null,"DAMAR YOGA KUSUMA","043746K07","Direct","No bridging","Single","MAT"]
[null,null,null,"Yu Zhen","043766E07","SM2","SM2-RP","Single","MAT"]
[null,null,null,"SUN CHENG","043771J07","SM2","SM2-RP","Single","MAT"]
[null,null,null,"Meng Fanjun","043775F07","SM3","SM2-AP/SM3","Single","MAT"]
[null,null,null,"CHEN YE","043813K07","SM3","SM2-AP/SM3","Single","MAT"]
[null,null,null,"RAHMAT AGUNG SUSANTYOKO","043815C07","Direct","No bridging","Single","MAT"]
[null,null,null,"WANG XIU","043873F07","SM3","SM2-AP/SM3","Single","MAT"]
[null,null,null,"Zhang Hualing","043893A07","SM3","SM2-AP/SM3","Single","MAT"]
[null,null,null,"WANG HONGRU","046602L02","SM2 (Accelerated)","SM2-AP/SM3","Single","CBE"]
[null,null,null,"NEBIL MAHABOOB","046664L02","Direct","No bridging","Single","CBE"]
[null,null,null,"SHARON ADELINA","046688C02","MOE PreU Scholar (ASEAN)","No bridging","Single","CBE"]
[null,null,null,"SUN HUI","046802H02","SM2","SM2-RP","Single","CBE"]
[null,null,null,"Shao Jun","046823E02","SM3","SM2-AP/SM3","Single","CBE"]
[null,null,null,"LIU YUSI","046846F02","SM2","SM2-RP","Single","CBE"]
[null,null,null,"JIANG MINGXUAN","046861B02","SM3","SM2-AP/SM3","Single","CBE"]
[null,null,null,"YUAN YIXIU","046869G02","SM3","SM2-AP/SM3","Single","CBE"]
[null,null,null,"ZHOU SHUANG","046877F02","MOE PreU Scholar (PRC)","No bridging","Single","CBE"]
[null,null,null,"HU YUEPING","046880F02","SM3","SM2-AP/SM3","Single","CBE"]
[null,null,null,"BO JUYI","046905G02","SM3","SM2-AP/SM3","Single","CBE"]
[null,null,null,"YAN QI","046908B02","SM3","SM2-AP/SM3","Single","CBE"]
[null,null,null,"Zhu Wenting","046912D02","SM2 (Accelerated)","SM2-AP/SM3","Single","CBE"]
[null,null,null,"LUCKY AGUS KURNIAWAN KOSASIH","046933A02","Direct","No bridging","Single","CBE"]
[null,null,null,"Xiong Beili","046945H02","SM3","SM2-AP/SM3","Single","CBE"]
[null,null,null,"OU YUANYUAN","046969L02","SM2","SM2-RP","Single","CBE"]
[null,null,null,"Sun Hongshuai","047917G03","SM3","SM2-AP/SM3","Single","EEE"]
[null,null,null,"HUANG HE","047999B03","SM3","SM2-AP/SM3","Single","EEE"]
[null,null,null,"XU SHU","048008C11","SM2","SM2-RP","Single","BS"]
[null,null,null,"Zhan Yajing","048067H11","SM2","SM2-RP","Single","BS"]
[null,null,null,"HE MUXINYA","048101D11","SM2","SM2-RP","Single","BS"]
[null,null,null,"LI BAIHONG","048109J11","SM3","SM2-AP/SM3",{"$f":"VLOOKUP(I$1:I$5281,$A$37:$B$212,2,FALSE)","v":"Single"},"BS"]
[null,null,null,"Sun Han","048124E11","SM2","SM2-RP","Single","BS"]
[null,null,null,"Jiang GuanYing","048149K11","SM2","SM2-RP","Single","BS"]
[null,null,null,"Ji Qiang","048169E11","SM3","SM2-AP/SM3","Single","BS"]
[null,null,null,"SHI YU","048268G11","SM2","SM2-RP","Single","BS"]
[null,null,null,"LU XINYI","048322J11","SM2","SM2-RP","Single","BS"]
[null,null,null,"LIU TONG","048406D11","SM3","SM2-AP/SM3","Single","BS"]
[null,null,null,"Liao Liang","048595E13","SM3","SM2-AP/SM3","Single","CSC"]
[null,null,null,"WILLIAM HUTAMA","048622D13","Direct","No bridging","Single","CSC"]
[null,null,null,"Liu Hui","048636D13","SM3","SM2-AP/SM3","Single","CSC"]
[null,null,null,"INDRANI SANTRA","048956L13","Direct","No bridging","Single","CSC"]
[null,null,null,"HUA XIN","049501A03","SM2","SM2-RP","Single","EEE"]
[null,null,null,"HAO ZHIPENG","049503E03","SM2","SM2-RP","Single","EEE"]
[null,null,null,"Zhang Juntao","049504G03","SM3","SM2-AP/SM3","Single","BIE"]
[null,null,null,"DENG WENSHENG","049505J03","SM3","SM2-AP/SM3","Single","EEE"]
[null,null,null,"Lin Zhe","049506L03","SM3","SM2-AP/SM3","Single","BIE"]
[null,null,null,"YANG YUGUANG","049507B03","SM3","SM2-AP/SM3","Single","EEE"]
[null,null,null,"ZHANG LEI","049510B03","SM3","SM2-AP/SM3","Single","EEE"]
[null,null,null,"SI GUANGLIN","049512F03","SM3","SM2-AP/SM3","Single","EEE"]
[null,null,null,"HE SHAN","049514K03","SM2","SM2-RP","Single","EEE"]
[null,null,null,"YU LIGUO","049515A03","SM3","SM2-AP/SM3","Single","EEE"]
[null,null,null,"HUANG GUANGPU","049516C03","SM3","SM2-AP/SM3","Single","EEE"]
[null,null,null,"CHAI YU","049517E03","SM3","SM2-AP/SM3","Single","EEE"]
[null,null,null,"ZHANG HE","049520E03","SM3","SM2-AP/SM3","Single","EEE"]
[null,null,null,"ZHONG YUAN","049521G03","SM3","SM2-AP/SM3","Single","BIE"]
[null,null,null,"YANG JINGXIA","049523L03","SM2","SM2-RP","Single","BIE"]
[null,null,null,"Yang Guangyu","049525D03","SM2","SM2-RP","Single","EEE"]
[null,null,null,"FANG ZHENG","049527H03","SM3","SM2-AP/SM3","Single","EEE"]
[null,null,null,"LIU JIANFENG","049528K03","SM3","SM2-AP/SM3","Single","EEE"]
[null,null,null,"XIE PENGFEI","049529A03","SM2","SM2-RP","Single","EEE"]
[null,null,null,"LIU SUPENG","049530H03","SM3","SM2-AP/SM3","Single","EEE"]
[null,null,null,"Li Rui","049533C03","SM3","SM2-AP/SM3","Single","EEE"]
[null,null,null,"YU PEICONG","049534E03","SM2","SM2-RP","Single","BIE"]
[null,null,null,"YU HANGYING","049535G03","SM3","SM2-AP/SM3","Single","EEE"]
[null,null,null,"SUN ZHUOXIN","049536J03","SM3","SM2-AP/SM3","Single","EEE"]
[null,null,null,"BEI JUNJUN","049537L03","SM3","SM2-AP/SM3","Single","EEE"]
[null,null,null,"PENG YU","049538B03","SM2","SM2-RP","Single","EEE"]
[null,null,null,"LIU LEI","049540L03","SM3","SM2-AP/SM3","Single","EEE"]
[null,null,null,"SUN ZHUOCHAO","049541B03","SM3","SM2-AP/SM3","Single","EEE"]
[null,null,null,"GU XIAOYUN","049542D03","SM2","SM2-RP","Single","EEE"]
[null,null,null,"ZHANG LI","049543F03","SM3","SM2-AP/SM3","Single","EEE"]
[null,null,null,"TAO QIAN","049544H03","SM3","SM2-AP/SM3","Single","EEE"]
[null,null,null,"Zhong QingXia","049545K03","SM2","SM2-RP","Single","ENE"]
[null,null,null,"LIU WENHU","049546A03","SM3","SM2-AP/SM3","Single","EEE"]
[null,null,null,"LI XING","049547C03","SM2","SM2-RP","Single","EEE"]
[null,null,null,"Zhao Rong Rong","049548E03","SM2 (Accelerated)","SM2-AP/SM3","Single","BIE"]
[null,null,null,"WANG FEI","049549G03","SM3","SM2-AP/SM3","Single","EEE"]
[null,null,null,"DENG FANGXIN","049550C03","SM3","SM2-AP/SM3","Single","EEE"]
[null,null,null,"ZHAO MING","049551E03","SM2","SM2-RP","Single","EEE"]
[null,null,null,"GUO WEI","049552G03","SM3","SM2-AP/SM3","Single","ME"]
[null,null,null,"ZHANG FAN","049555B03","SM3","SM2-AP/SM3","Single","EEE"]
[null,null,null,"XU SHOUHENG","049557F03","SM3","SM2-AP/SM3","Single","EEE"]
[null,null,null,"Shao SunYi","049558H03","SM2","SM2-RP","Single","EEE"]
[null,null,null,"DUAN RAN","049559K03","SM2","SM2-RP","Single","EEE"]
[null,null,null,"GAO JING","049561H03","SM3","SM2-AP/SM3","Single","EEE"]
[null,null,null,"TIAN YANG","049563A03","SM3","SM2-AP/SM3","Single","EEE"]
[null,null,null,"FU CHUNMIAO","049565E03","SM3","SM2-AP/SM3","Single","EEE"]
[null,null,null,"YU TIANQI","049566G03","SM2","SM2-RP","Single","EEE"]
[null,null,null,"SUN YUAN","049567J03","SM3","SM2-AP/SM3","Single","EEE"]
[null,null,null,"HE WENJIE","049568L03","SM3","SM2-AP/SM3","Single","CEE"]
[null,null,null,"CHEN JUNSONG","049569B03","SM2","SM2-RP","Single","BIE"]
[null,null,null,"GUAN XIAOCHONG","049570J03","SM3","SM2-AP/SM3","Single","EEE"]
[null,null,null,"YUAN YINGNA","049571L03","SM2","SM2-RP","Single","EEE"]
[null,null,null,"WU LING","049573D03","SM3","SM2-AP/SM3","Single","EEE"]
[null,null,null,"QU HUI","049574F03","SM2","SM2-RP",{"$f":"VLOOKUP(I$1:I$5281,$A$37:$B$212,2,FALSE)","v":"Single"},"EEE"]
[null,null,null,"YAN YANG","049575H03","SM2","SM2-RP","Single","EEE"]
[null,null,null,"WANG YAO","049576K03","SM2","SM2-RP","Single","BIE"]
[null,null,null,"Wan Cheng","049577A03","SM2","SM2-RP","Single","EEE"]
[null,null,null,"SUN HUANLIANG","049578C03","SM3","SM2-AP/SM3","Single","EEE"]
[null,null,null,"ZHAO ZHI","049579E03","SM2","SM2-RP","Single","EEE"]
[null,null,null,"YANG KAN","049581C03","SM2","SM2-RP","Single","EEE"]
[null,null,null,"JIAO YU","049582E03","SM2","SM2-RP","Single","BIE"]
[null,null,null,"ZHANG MENG","049583G03","SM3","SM2-AP/SM3","Single","EEE"]
[null,null,null,"CHEN YAQI","049584J03","SM3","SM2-AP/SM3","Single","EEE"]
[null,null,null,"Cong Ning","049585L03","SM2","SM2-RP","Single","EEE"]
[null,null,null,"ZHANG GUOWEI","049588F03","SM3","SM2-AP/SM3","Single","EEE"]
[null,null,null,"CHANG WANLI","049591F03","SM2 (Accelerated)","SM2-AP/SM3","Single","EEE"]
[null,null,null,"WEI XUE","049592H03","SM2","SM2-RP","Single","EEE"]
[null,null,null,"ZHANG JINDONG","049594A03","SM3","SM2-AP/SM3","Single","ME"]
[null,null,null,"DENG GUANGLEI","049595C03","SM2 (Accelerated)","SM2-AP/SM3","Single","EEE"]
[null,null,null,"XU MINGMING","049596E03","SM3","SM2-AP/SM3","Single","EEE"]
[null,null,null,"LIANG KUN","049597G03","SM3","SM2-AP/SM3","Single","EEE"]
[null,null,null,"PANG CAIJI","049598J03","SM3","SM2-AP/SM3","Single","EEE"]
[null,null,null,"LI DONGDONG","049599L03","SM3","SM2-AP/SM3","Single","EEE"]
[null,null,null,"Wang Xinlei","049600C03","SM2","SM2-RP","Single","EEE"]
[null,null,null,"REN YE","049601E03","SM3","SM2-AP/SM3","Single","EEE"]
[null,null,null,"LI XUN","049603J03","SM2","SM2-RP","Single","EEE"]
[null,null,null,"SUO YUJING","049604L03","SM3","SM2-AP/SM3","Single","EEE"]
[null,null,null,"LI CHONG","049605B03","SM3","SM2-AP/SM3","Single","EEE"]
[null,null,null,"ZHANG HUIYUAN","049606D03","SM3","SM2-AP/SM3","Single","EEE"]
[null,null,null,"ZHOU ZHENG","049607F03","SM3","SM2-AP/SM3","Single","EEE"]
[null,null,null,"HUANG ZHAO","049608H03","SM3","SM2-AP/SM3","Single","ME"]
[null,null,null,"Zhang TiRan","049609K03","SM2","SM2-RP","Single","CEE"]
[null,null,null,"ZHANG SHENGLIN","049610F03","SM2","SM2-RP","Single","EEE"]
[null,null,null,"QIU HAODONG","049611H03","SM3","SM2-AP/SM3","Single","EEE"]
[null,null,null,"MEI LI","049612K03","SM2","SM2-RP","Single","ENE"]
[null,null,null,"YIN JINGYI","049613A03","SM2","SM2-RP","Single","EEE"]
[null,null,null,"LIAO LEI","049614C03","SM3","SM2-AP/SM3","Single","EEE"]
[null,null,null,"ZHOU CHENGCHENG","049615E03","SM2","SM2-RP","Single","EEE"]
[null,null,null,"SHAN LIANG","049616G03","SM3","SM2-AP/SM3","Single","EEE"]
[null,null,null,"LIU TING","049617J03","SM3","SM2-AP/SM3","Single","EEE"]
[null,null,null,"LI WU","049618L03","SM2","SM2-RP","Single","EEE"]
[null,null,null,"SHEN LINJUN","049620J03","SM2","SM2-RP","Single","EEE"]
[null,null,null,"HUANG ZELIN","049621L03","SM3","SM2-AP/SM3","Single","EEE"]
[null,null,null,"LIN TONG","049622B03","SM2","SM2-RP","Single","EEE"]
[null,null,null,"MA QIAN","049624F03","SM3","SM2-AP/SM3","Single","BIE"]
[null,null,null,"WU KAI","049625H03","SM3","SM2-AP/SM3","Single","EEE"]
[null,null,null,"LIN BO","049626K03","SM2 (Accelerated)","SM2-AP/SM3","Single","EEE"]
[null,null,null,"Qiu Ningyi","049627A03","SM3","SM2-AP/SM3","Single","EEE"]
[null,null,null,"FU KANGKANG","049628C03","SM3","SM2-AP/SM3","Single","EEE"]
[null,null,null,"XU MINGJING","049630A03","SM3","SM2-AP/SM3","Single","EEE"]
[null,null,null,"LI HUI","049632E03","SM2","SM2-RP","Single","EEE"]
[null,null,null,"XU SAIHUA","049633G03","SM3","SM2-AP/SM3","Single","EEE"]
[null,null,null,"DUAN TIANDI","049635L03","SM2","SM2-RP","Single","EEE"]
[null,null,null,"LIU XIAO","049637D03","SM3","SM2-AP/SM3","Single","EEE"]
[null,null,null,"PAN HAO","049638F03","SM2 (Accelerated)","SM2-AP/SM3","Single","EEE"]
[null,null,null,"DENG YIRUI","049639H03","SM2","SM2-RP","Single","EEE"]
[null,null,null,"DONG TONGTONG","049641F03","SM3","SM2-AP/SM3","Single","EEE"]
[null,null,null,"GUO YUMING","049642H03","SM3","SM2-AP/SM3","Single","BIE"]
[null,null,null,"JIN CHONGFEI","049643K03","SM3","SM2-AP/SM3","Single","EEE"]
[null,null,null,"WANG XIAORAN","049644A03","SM2","SM2-RP","Single","EEE"]
[null,null,null,"HUANG GUIXIANG","049645C03","SM3","SM2-AP/SM3","Single","EEE"]
[null,null,null,"YANG MINGFEI","049646E03","SM3","SM2-AP/SM3","Single","EEE"]
[null,null,null,"YANG BO","049647G03","SM2","SM2-RP","Single","EEE"]
[null,null,null,"MA SHOUZHI","049648J03","SM2","SM2-RP","Single","EEE"]
[null,null,null,"Liang Dayang","049649L03","SM3","SM2-AP/SM3","Single","BIE"]
[null,null,null,"YANG YIZHOU","049651J03","SM3","SM2-AP/SM3","Single","EEE"]
[null,null,null,"ZHANG LING","049653B03","SM3","SM2-AP/SM3","Single","EEE"]
[null,null,null,"JIANG XIE","049655F03","SM2","SM2-RP",{"$f":"VLOOKUP(I$1:I$5281,$A$37:$B$212,2,FALSE)","v":"Single"},"ENE"]
[null,null,null,"CHEN YAO","049658A03","SM2","SM2-RP","Single","ME"]
[null,null,null,"ZHOU YIFAN","049659C03","SM2","SM2-RP","Single","BIE"]
[null,null,null,"DAI JINGYU","049660K03","SM2","SM2-RP","Single","EEE"]
[null,null,null,"QIAN HANHUA","049661A03","SM2 (Accelerated)","SM2-AP/SM3","Single","EEE"]
[null,null,null,"WANG ZHAOMENG","049663E03","SM3","SM2-AP/SM3","Single","ME"]
[null,null,null,"ZHAO XIN","049664G03","SM2","SM2-RP","Single","ME"]
[null,null,null,"JIAO YU","049665J03","SM3","SM2-AP/SM3","Single","ME"]
[null,null,null,"SHAN WENMING","049666L03","SM3","SM2-AP/SM3","Single","EEE"]
[null,null,null,"Liu JiaYin","049668D03","SM2","SM2-RP","Single","EEE"]
[null,null,null,"HU HUIJIE","049669F03","SM3","SM2-AP/SM3","Single","EEE"]
[null,null,null,"YAO YUJIN","049670B03","SM3","SM2-AP/SM3","Single","EEE"]
[null,null,null,"FU HAITAO","049671D03","SM3","SM2-AP/SM3","Single","EEE"]
[null,null,null,"ZHU LING","049673H03","SM3","SM2-AP/SM3","Single","EEE"]
[null,null,null,"JIN XU","049675A03","SM3","SM2-AP/SM3","Single","EEE"]
[null,null,null,"LUAN XUENA","049676C03","SM3","SM2-AP/SM3","Single","EEE"]
[null,null,null,"YANG ZHAO","049680E03","SM2","SM2-RP","Single","CEE"]
[null,null,null,"Zhang Can","049682J03","SM3","SM2-AP/SM3","Single","EEE"]
[null,null,null,"Sun Li","049683L03","SM3","SM2-AP/SM3","Single","EEE"]
[null,null,null,"Li Kan","049684B03","SM2","SM2-RP","Single","ENE"]
[null,null,null,"LIU WENLI","049685D03","SM3","SM2-AP/SM3","Single","EEE"]
[null,null,null,"YU KAI","049686F03","SM3","SM2-AP/SM3","Single","EEE"]
[null,null,null,"SHI WENQIAN","049687H03","SM3","SM2-AP/SM3","Single","EEE"]
[null,null,null,"GE BIN","049691K03","SM3","SM2-AP/SM3","Single","EEE"]
[null,null,null,"QING SONGLIN","049692A03","SM3","SM2-AP/SM3","Single","EEE"]
[null,null,null,"DONG QI","049693C03","SM3","SM2-AP/SM3","Single","EEE"]
[null,null,null,"ZHAI YAO","049694E03","SM3","SM2-AP/SM3","Single","EEE"]
[null,null,null,"GUO MIN","049695G03","SM3","SM2-AP/SM3","Single","EEE"]
[null,null,null,"YU JUN","049696J03","SM3","SM2-AP/SM3","Single","EEE"]
[null,null,null,"SHEN NAN","049699D03","SM3","SM2-AP/SM3","Single","EEE"]
[null,null,null,"HUANG MINGHUI","049764F14","SM3","SM2-AP/SM3","Single","MS"]
[null,null,null,"WANG XIAOYU","049771C14","SM2","SM2-RP","Single","MS"]
[null,null,null,"CHENG FAN","049826B14","SM2","SM2-RP","Single","MS"]
[null,null,null,"HOU WANYI","049846H14","SM3","SM2-AP/SM3","Single","MS"]
[null,null,null,"Wang Duanwei","049904G14","SM3","SM2-AP/SM3","Single","MS"]
[null,null,null,"Shao Jiong","049934E14","SM2","SM2-RP","Single","MS"]
[null,null,null,"NIU WENJUE","049945K14","SM2","SM2-RP","Single","MS"]
[null,null,null,"CHEN CHUNXIAO","049983G14","SM2","SM2-RP","Single","MS"]
[null,null,null,"Yang Peidong","049986B14","SM2","SM2-RP","Single","MS"]
[null,null,null,"HUANG KE","050035K02","SM3","SM2-AP/SM3","Single","CBE"]
[null,null,null,"YU SHAN","050098A02","SM3","SM2-AP/SM3","Single","CBE"]
[null,null,null,"LU HONGHONG","050114F02","SM2","SM2-RP","Single","CBE"]
[null,null,null,"SRIRAM SRIVATSAV","050179A02","Direct","No bridging","Single","CBE"]
[null,null,null,"LIU QING","050224B02","SM2","SM2-RP","Single","CBE"]
[null,null,null,"LIU FANG","050279E02","SM3","SM2-AP/SM3","Single","CBE"]
[null,null,null,"MAYAS SINGH","050365J02","Direct","No bridging","Single","CBE"]
[null,null,null,"CHEN WAN","050379J02","SM3","SM2-AP/SM3","Single","CBE"]
[null,null,null,"CHOUDHURY ANSHUMAN DAS","050501B02","SIA Youth","No bridging","Single","CBE"]
[null,null,null,"TIAN LIMING","050509G02","SM2","SM2-RP","Single","CBE"]
[null,null,null,"LIU MAOLONG","050513J02","SM2","SM2-RP","Single","CBE"]
[null,null,null,"LI HONG","050547L07","SM3","SM2-AP/SM3","Single","MAT"]
[null,null,null,"WU RUIHONG","050550L07","SM3","SM2-AP/SM3","Single","MAT"]
[null,null,null,"GONG TIANXING","050555K07","SM3","SM2-AP/SM3","Single","MAT"]
[null,null,null,"TANG JIE","050562G07","SM3","SM2-AP/SM3","Single","MAT"]
[null,null,null,"WANG WEI","050571H07","SM3","SM2-AP/SM3","Single","MAT"]
[null,null,null,"DING SIXING","050573A07","SM3","SM2-AP/SM3","Single","MAT"]
[null,null,null,"WU ZHENQI","050576G07","SM2","SM2-RP","Single","MAT"]
[null,null,null,"Wang Xinjie","050588C07","SM2 (Accelerated)","SM2-AP/SM3","Single","MAT"]
[null,null,null,"JIANG YUEYUE","050596B07","SM2","SM2-RP","Single","MAT"]
[null,null,null,"HU GE","050602D07","SM3","SM2-AP/SM3","Single","MAT"]
[null,null,null,"YU XILAN","050605K07","SM3","SM2-AP/SM3","Single","MAT"]
[null,null,null,"NI SISI","050613J07","SM3","SM2-AP/SM3","Single","MAT"]
[null,null,null,"ZHANG CHENG","050632B07","SM3","SM2-AP/SM3","Single","MAT"]
[null,null,null,"CHEN HONGYU","050656E07","SM2","SM2-RP","Single","MAT"]
[null,null,null,"DING GUOQIANG","050666H07","SM3","SM2-AP/SM3",{"$f":"VLOOKUP(I$1:I$5281,$A$37:$B$212,2,FALSE)","v":"Single"},"MAT"]
[null,null,null,"SUN SHUANGYONG","050676L07","SM3","SM2-AP/SM3","Single","MAT"]
[null,null,null,"WU XIAOYING","050680B07","SM3","SM2-AP/SM3","Single","MAT"]
[null,null,null,"ZHU JIANFENG","050684K07","SM2","SM2-RP","Single","MAT"]
[null,null,null,"ZHAO LU","050693L07","SM3","SM2-AP/SM3","Single","MAT"]
[null,null,null,"ZUO CAIXING","050711J07","SM3","SM2-AP/SM3","Single","MAT"]
[null,null,null,"CHEN PENG","050715F07","SM3","SM2-AP/SM3","Single","MAT"]
[null,null,null,"ZHAO QIN","050720K07","SM3","SM2-AP/SM3","Single","MAT"]
[null,null,null,"ZOU CHANGJI","050722C07","SM2","SM2-RP","Single","MAT"]
[null,null,null,"YANG XIAOYU","050730B07","SM2","SM2-RP","Single","MAT"]
[null,null,null,"MIAO ZICHAO","050739J07","SM2","SM2-RP","Single","MAT"]
[null,null,null,"SHAO QI","050745D07","SM2","SM2-RP","Single","MAT"]
[null,null,null,"ZHU YI","050750H07","SM2","SM2-RP","Single","MAT"]
[null,null,null,"GAO LI","050754E07","SM2","SM2-RP","Single","MAT"]
[null,null,null,"YAN FANG","050757L07","SM2","SM2-RP","Single","MAT"]
[null,null,null,"LI ZHENGGANG","050797A07","SM3","SM2-AP/SM3","Single","MAT"]
[null,null,null,"HU XINYAO","050805G07","SM2","SM2-RP","Single","MAT"]
[null,null,null,"YAN LINA","050817C07","SM3","SM2-AP/SM3","Single","MAT"]
[null,null,null,"HE XUEYA","050822G07","SM2","SM2-RP","Single","MAT"]
[null,null,null,"DU HONGTAO","050824L07","SM2","SM2-RP","Single","MAT"]
[null,null,null,"LI XIAO","051108H11","SM3","SM2-AP/SM3","Single","BS"]
[null,null,null,"BI XIAOLU","051134J11","SM2","SM2-RP","Single","BS"]
[null,null,null,"HOU QIAN","051142H11","SM3","SM2-AP/SM3","Single","BS"]
[null,null,null,"NIE XIN","051164G11","SM2","SM2-RP","Single","BS"]
[null,null,null,"CHENG WEI","051197L11","SM3","SM2-AP/SM3","Single","BS"]
[null,null,null,"DONG XUEMING","051199D11","SM2","SM2-RP","Single","BS"]
[null,null,null,"ZHONG LINSHAN","051250L11","SM3","SM2-AP/SM3","Single","BS"]
[null,null,null,"YANG XIAOQING","051341C11","SM3","SM2-AP/SM3","Single","BS"]
[null,null,null,"BAI YANG","051411J11","SM2","SM2-RP","Single","BS"]
[null,null,null,"HARIS","051448K11","Direct","No bridging","Single","BS"]
[null,null,null,"QI LIHUA","051468E11","SM3","SM2-AP/SM3","Single","BS"]
[null,null,null,"ZHENG BOYANG","051580K11","SM3","SM2-AP/SM3","Single","BS"]
[null,null,null,"XU PENG","051597G14","SM2 (Accelerated)","SM2-AP/SM3","Single","MS"]
[null,null,null,"SHEN NAN","051598J14","SM3","SM2-AP/SM3","Single","MS"]
[null,null,null,"ZHANG HONGZHOU","051599L14","SM3","SM2-AP/SM3","Single","MS"]
[null,null,null,"LI WEN","051601E14","SM2","SM2-RP","Single","MS"]
[null,null,null,"TANG XIAOXU","051604L14","SM2","SM2-RP","Single","MS"]
[null,null,null,"WU MENGXIA","051617J14","SM2","SM2-RP","Single","MS"]
[null,null,null,"SUN QIAN","051624F14","SM3","SM2-AP/SM3","Single","MS"]
[null,null,null,"LUO CHAO","051635L14","SM3","SM2-AP/SM3","Single","MS"]
[null,null,null,"LUO YINDI","051642H14","SM3","SM2-AP/SM3","Single","MS"]
[null,null,null,"LIN SENTONG","051643K14","SM2 (Accelerated)","SM2-AP/SM3","Single","MS"]
[null,null,null,"LI QING","051648J14","SM3","SM2-AP/SM3","Single","MS"]
[null,null,null,"DHINI PURNAMASARI","051650G14","Direct","No bridging","Single","MS"]
[null,null,null,"XIA WEN","051656H14","SM2","SM2-RP","Single","MS"]
[null,null,null,"TANG XINGYAN","051659C14","SM2 (Accelerated)","SM2-AP/SM3","Single","MS"]
[null,null,null,"YANG CEN","051675A14","SM3","SM2-AP/SM3","Single","MS"]
[null,null,null,"GE YAO","051706E15","SM2","SM2-RP","Single","AERO"]
[null,null,null,"SOLLIN SELVAN ANBU","051759D15","SIA Youth","No bridging","Single","AERO"]
[null,null,null,"VENUGOPALAN SRINIVASA GOPALA RAGHAVAN","051762D15","Direct","No bridging","Single","AERO"]
[null,null,null,"ADITYA MAHESH KHATRI","051807L15","SIA Youth","No bridging","Single","AERO"]
[null,null,null,"REN FEI","053024A16","SM2","SM2-RP","Single","CHEM"]
[null,null,null,"JEFRI SANUSI TEGUH","053038A16","Direct","No bridging","Single","CHEM"]
[null,null,null,"JIN YING","053048D16","SM2","SM2-RP","Single","CHEM"]
[null,null,null,"FU TIANPEI","053078B16","SM3","SM2-AP/SM3","Single","CHEM"]
[null,null,null,"YI PENG","053099K16","SM3","SM2-AP/SM3","Single","MATH"]
[null,null,null,"WANG FANGFANG","053121K16","SM2","SM2-RP","Single","PHY"]
[null,null,null,"SHI YANNAN","053156G16","SM2","SM2-RP","Single","MATH"]
[null,null,null,"SHAO LEI","053161L16","SM2 (Accelerated)","SM2-AP/SM3","Single","MATH"]
[null,null,null,"LAI LINKE","053177D16","SM2 (Accelerated)","SM2-AP/SM3","Single","CHEM"]
[null,null,null,"JIA CHAO","053206G16","SM2","SM2-RP","Single","MATH"]
[null,null,null,"GAO JING","053219E16","SM3","SM2-AP/SM3","Single","PHY"]
[null,null,null,"ZHANG XUAN","053250K16","SM2","SM2-RP","Single","MATH"]
[null,null,null,"XU FENGXIA","053255J16","SM2","SM2-RP","Single","CHEM"]
[null,null,null,"PHILIP KWAN","053267E16","Direct","No bridging",{"$f":"VLOOKUP(I$1:I$5281,$A$37:$B$212,2,FALSE)","v":"Single"},"PHY"]
[null,null,null,"CHENG TIANYIN","053328K16","SM2","SM2-RP","Single","MATH"]
[null,null,null,"XIA BIN","053336J16","SM3","SM2-AP/SM3","Single","PHY"]
[null,null,null,"WANG JINGXI","053343F16","SM2","SM2-RP","Single","MATH"]
[null,null,null,"WU XING","053348E16","SM3","SM2-AP/SM3","Single","PHY"]
[null,null,null,"FU JINGYU","053412K16","SM2","SM2-RP","Single","MATH"]
[null,null,null,"GUO MIN","053422B16","SM3","SM2-AP/SM3","Single","PHY"]
[null,null,null,"JIANG JUNWEI","054372L06","SM3","SM2-AP/SM3","Single","CE"]
[null,null,null,"ANDRE SUCHITRA","054375F06","Direct","No bridging","Single","CE"]
[null,null,null,"XING PENGFEI","054377K06","SM2","SM2-RP","Single","CE"]
[null,null,null,"PAN KESHANG","054410D06","SM2","SM2-RP","Single","CE"]
[null,null,null,"FAJRI HANNY","054421J06","Direct","No bridging","Single","CSC"]
[null,null,null,"WAN LI","054430K06","SM2","SM2-RP","Single","CE"]
[null,null,null,"ZHAI KE","054451G06","SM2","SM2-RP","Single","CE"]
[null,null,null,"KRISHNAN ASWATH","054479G06","Direct","No bridging","Single","CE"]
[null,null,null,"ZHANG ZONGHUI","054485B06","SM3","SM2-AP/SM3","Single","CE"]
[null,null,null,"SU YEZHEN","054492K06","SM2","SM2-RP","Single","CE"]
[null,null,null,"WU TIANHUAI","054493A06","SM3","SM2-AP/SM3","Single","CE"]
[null,null,null,"YASH SETH","054523F06","Direct","No bridging","Single","CE"]
[null,null,null,"LIU CHAOQUN","054525K06","SM3","SM2-AP/SM3","Single","CE"]
[null,null,null,"RAMKUMAR PRANAV","054555H06","Direct","No bridging","Single","CE"]
[null,null,null,"NEHA CHACHRA","054557A06","Direct","No bridging","Single","CSC"]
[null,null,null,"GU LINGQING","054571F06","SM2","SM2-RP","Single","CE"]
[null,null,null,"SARI SETIANINGSIH","054609E06","Direct","No bridging","Single","CE"]
[null,null,null,"YUAN XIQUAN","054613G06","SM3","SM2-AP/SM3","Single","CE"]
[null,null,null,"ZHENG YANJUN","054618F06","SM3","SM2-AP/SM3","Single","CE"]
[null,null,null,"CHANG LICHUAN","054645J06","SM3","SM2-AP/SM3","Single","CE"]
[null,null,null,"DEWA PUTU PRAMAYOGA YUDISTIRA","054680L06","Direct","No bridging","Single","CE"]
[null,null,null,"BHASKER RAHUL","054689G06","Direct","No bridging","Single","CSC"]
[null,null,null,"WANG WENWEN","054698H06","SM2","SM2-RP","Single","CE"]
[null,null,null,"MANAN GUPTA","054699K06","Direct","No bridging","Single","CE"]
[null,null,null,"KUANG YILI","054700B06","SM3","SM2-AP/SM3","Single","CE"]
[null,null,null,"HAN TINGYUE","054706C06","SM3","SM2-AP/SM3","Single","CE"]
[null,null,null,"SHEN NAN","054714B06","SM2","SM2-RP","Single","CSC"]
[null,null,null,"ZENG FANCHAO","054720H06","SM2","SM2-RP","Single","CE"]
[null,null,null,"OUYANG YIN","054747F06","SM3","SM2-AP/SM3","Single","CSC"]
[null,null,null,"MA FUQIANG","054749K06","SM3","SM2-AP/SM3","Single","CE"]
[null,null,null,"ZHAO YIFAN","054775L06","SM2","SM2-RP","Single","CE"]
[null,null,null,"PUSHKAR RAJ SHARMA","054795F06","Direct","No bridging","Single","CE"]
[null,null,null,"YANG WEI","054813D06","SM3","SM2-AP/SM3","Single","CE"]
[null,null,null,"GROVER NIKHIL","054823G06","Direct","No bridging","Single","CE"]
[null,null,null,"SUN QINGSHUAN","054848A06","SM3","SM2-AP/SM3","Single","CE"]
[null,null,null,"KANISHK DUGAR","054857B06","Direct","No bridging","Single","CE"]
[null,null,null,"SHENG XIAOGENG","054860B06","SM3","SM2-AP/SM3","Single","CE"]
[null,null,null,"LAKSHMI BALACHANDRAN","054862F06","Direct","No bridging","Single","CE"]
[null,null,null,"NAGARAJAN ASHWIN VENKATESH","054887L06","Direct","No bridging","Single","CE"]
[null,null,null,"LIN BO","054904G06","SM2 (Accelerated)","SM2-AP/SM3","Single","CSC"]
[null,null,null,"HU YUNWEN","054905J06","SM3","SM2-AP/SM3","Single","CE"]
[null,null,null,"DING CAIHONG","054908D06","SM3","SM2-AP/SM3","Single","CE"]
[null,null,null,"ZHANG HAO","054926F06","SM3","SM2-AP/SM3","Single","CE"]
[null,null,null,"WU CHENSHENG","054943F06","SM3","SM2-AP/SM3","Single","CE"]
[null,null,null,"ZHONG WEIXIANG","054954L06","SM3","SM2-AP/SM3","Single","CE"]
[null,null,null,"DONG WEI","054995C06","SM3","SM2-AP/SM3","Single","CE"]
[null,null,null,"SAPAN VIG","054997G06","Direct","No bridging","Single","CE"]
[null,null,null,"ANTHONY KHO","055011H06","Direct","No bridging","Single","CE"]
[null,null,null,"KOE DAVID KURNIAWAN","055054D06","Direct","No bridging","Single","CE"]
[null,null,null,"ZHOU WEICHENG","055062C06","SM2","SM2-RP","Single","CE"]
[null,null,null,"ZHANG CHEN","057436H03","SM2","SM2-RP","Single","EEE"]
[null,null,null,"ZHANG XI","057457E03","SM3","SM2-AP/SM3","Single","EEE"]
[null,null,null,"CHENG LIHANG","057462J03","MOE PreU Scholar (PRC)","No bridging","Single","EEE"]
[null,null,null,"LI KEKE","057472A03","SM2","SM2-RP","Single","EEE"]
[null,null,null,"CHENG WEI","057475G03","SM3","SM2-AP/SM3","Single","EEE"]
[null,null,null,"QU YI","057479D03","SM3","SM2-AP/SM3","Single","EEE"]
[null,null,null,"GUO WENJIANG","057482D03","SM3","SM2-AP/SM3","Single","ME"]
[null,null,null,"XIAO XUAN","057493J03","SM2","SM2-RP",{"$f":"VLOOKUP(I$1:I$5281,$A$37:$B$212,2,FALSE)","v":"Single"},"BIE"]
[null,null,null,"ALFREDO SETIABUDI","057512J03","Direct","No bridging","Single","ME"]
[null,null,null,"LIU YUYANG","057525G03","SM3","SM2-AP/SM3","Single","EEE"]
[null,null,null,"LIU CHANG","057528B03","SM2","SM2-RP","Single","ENE"]
[null,null,null,"FERRY ANGGORO ARDY NUGROHO","057539G03","Direct","No bridging","Single","EEE"]
[null,null,null,"SUN SONG","057549K03","SM2 (Accelerated)","SM2-AP/SM3","Single","EEE"]
[null,null,null,"PARAKKAL PAUL GEORGE","057557J03","Direct","No bridging","Single","EEE"]
[null,null,null,"ZHANG YI","057558L03","SM2 (Accelerated)","SM2-AP/SM3","Single","CEE"]
[null,null,null,"BAI YONGCHAO","057583K03","SM3","SM2-AP/SM3","Single","EEE"]
[null,null,null,"ZENG YONG","057586E03","SM3","SM2-AP/SM3","Single","EEE"]
[null,null,null,"QIU MENGRAN","057601H03","SM3","SM2-AP/SM3","Single","EEE"]
[null,null,null,"ZENG YU","057634A03","SM3","SM2-AP/SM3","Single","EEE"]
[null,null,null,"ZHAO GUANGLEI","057638J03","SM3","SM2-AP/SM3","Single","EEE"]
[null,null,null,"ZHANG WU","057652C03","SM3","SM2-AP/SM3","Single","EEE"]
[null,null,null,"CHENG SHAN","057663H03","SM3","SM2-AP/SM3","Single","EEE"]
[null,null,null,"XIONG YUANTING","057672J03","SM3","SM2-AP/SM3","Single","EEE"]
[null,null,null,"LIN YAYING","057690L03","SM3","SM2-AP/SM3","Single","EEE"]
[null,null,null,"LI YANGQI","057698E03","SM3","SM2-AP/SM3","Single","EEE"]
[null,null,null,"ZHU YUNFENG","057707B03","SM3","SM2-AP/SM3","Single","EEE"]
[null,null,null,"NICHOLAS ADI WIBOWO","057712F03","Direct","No bridging","Single","EEE"]
[null,null,null,"LI JIYUN","057719J03","SM3","SM2-AP/SM3","Single","EEE"]
[null,null,null,"WANG KUN","057754L03","SM3","SM2-AP/SM3","Single","EEE"]
[null,null,null,"BI RAN","057760F03","SM2","SM2-RP","Single","EEE"]
[null,null,null,"YAO CHANGJIANG","057783G03","SM2 (Accelerated)","SM2-AP/SM3","Single","EEE"]
[null,null,null,"STEPHANIE","057798J03","Direct","No bridging","Single","BIE"]
[null,null,null,"BAO YICAI","057807F03","SM3","SM2-AP/SM3","Single","EEE"]
[null,null,null,"GU YUN","057811H03","SM3","SM2-AP/SM3","Single","EEE"]
[null,null,null,"CHEN WEIRAN","057813A03","SM2","SM2-RP","Single","EEE"]
[null,null,null,"ZENG WEI","057828C03","MOE PreU Scholar (PRC)","No bridging","Single","EEE"]
[null,null,null,"HUANG DONGYU","057835L03","SM2","SM2-RP","Single","ME"]
[null,null,null,"ZHU JUNFEI","057856H03","SM2","SM2-RP","Single","ENE"]
[null,null,null,"JHALLY GAGANJIT SINGH","057862C03","Direct","No bridging","Single","EEE"]
[null,null,null,"ZHENG YUTING","057872F03","SM2","SM2-RP","Single","EEE"]
[null,null,null,"KOUSTUBAN RAVI","057886F03","Direct","No bridging","Single","EEE"]
[null,null,null,"DING WEI","057894E03","SM2","SM2-RP","Single","EEE"]
[null,null,null,"HUANG SIWEI","057900G03","SM2","SM2-RP","Single","EEE"]
[null,null,null,"LIU JUNXIAN","057908A03","SM3","SM2-AP/SM3","Single","CEE"]
[null,null,null,"XU XIAOLI","057942A03","SM3","SM2-AP/SM3","Single","EEE"]
[null,null,null,"ZHU YAO","057945G03","SM2","SM2-RP","Single","EEE"]
[null,null,null,"ZHOU JIA","057946J03","SM2","SM2-RP","Single","EEE"]
[null,null,null,"LIU MING","057973A03","SM2","SM2-RP","Single","EEE"]
[null,null,null,"XIANG XIZHU","057991C03","SM2","SM2-RP","Single","ENE"]
[null,null,null,"XIE DAN","057992E03","SM3","SM2-AP/SM3","Single","BIE"]
[null,null,null,"WANG YANG","058002D03","SM3","SM2-AP/SM3","Single","EEE"]
[null,null,null,"LU HAOCHUAN","058058J03","SM3","SM2-AP/SM3","Single","EEE"]
[null,null,null,"YANG LEI","058088G03","SM2","SM2-RP","Single","EEE"]
[null,null,null,"WANG LU","058109L03","SM2","SM2-RP","Single","ME"]
[null,null,null,"ZHAO CHEN","058125J03","SM2","SM2-RP","Single","CEE"]
[null,null,null,"HE LINING","058158B03","SM3","SM2-AP/SM3","Single","EEE"]
[null,null,null,"KARTHIK THIRUGNANAM","058177F03","Direct","No bridging","Single","EEE"]
[null,null,null,"LANBA ASHEESH","058187J03","Direct","No bridging","Single","ME"]
[null,null,null,"MRINAL KAPOOR","058189B03","Direct","No bridging","Single","EEE"]
[null,null,null,"MENG YUANPING","058190J03","SM2","SM2-RP","Single","ENE"]
[null,null,null,"HERMAWAN RAHARJO","058200H03","Direct","No bridging","Single","EEE"]
[null,null,null,"ZHOU PEIHUA","058224L03","SM2 (Accelerated)","SM2-AP/SM3","Single","EEE"]
[null,null,null,"NANCY PERMATASARI WIDJAJA","058226D03","Direct","No bridging","Single","CEE"]
[null,null,null,"XIN MENGWEI","058232K03","SM3","SM2-AP/SM3","Single","EEE"]
[null,null,null,"JIANG YUWEI","058260D03","SM3","SM2-AP/SM3","Single","BIE"]
[null,null,null,"WANG JINGLEI","058318J03","SM2","SM2-RP","Single","CEE"]
[null,null,null,"HUANG YAPING","058339F03","SM3","SM2-AP/SM3","Single","ME"]
[null,null,null,"YANG CHUANG","058367L03","SM3","SM2-AP/SM3","Single","EEE"]
[null,null,null,"ZHOU HONGMING","058369D03","SM3","SM2-AP/SM3","Single","EEE"]
[null,null,null,"TRI WIRA EFENDI","058393A03","Direct","No bridging","Single","ME"]
[null,null,null,"ZHANG ZUYI","058398L03","SM2","SM2-RP","Single","EEE"]
[null,null,null,"LIU XIAOYU","058405D03","SM3","SM2-AP/SM3",{"$f":"VLOOKUP(I$1:I$5281,$A$37:$B$212,2,FALSE)","v":"Single"},"EEE"]
[null,null,null,"UMAYI KALYANARAMUDU HARISHKUMAR","058415G03","Direct","No bridging","Single","EEE"]
[null,null,null,"HE ZHONGJIE","058426A03","SM2","SM2-RP","Single","ME"]
[null,null,null,"ANKIT JAGGI","058445E03","Direct","No bridging","Single","EEE"]
[null,null,null,"DENG ANQI","058446G03","SM2","SM2-RP","Single","ENE"]
[null,null,null,"TIAN PENG","058496L03","SM2","SM2-RP","Single","EEE"]
[null,null,null,"MARCEL PRAYOGO","058559J03","MOE PreU Scholar (ASEAN)","No bridging","Single","ME"]
[null,null,null,"WANG GAOPENG","058569A03","SM3","SM2-AP/SM3","Single","EEE"]
[null,null,null,"LIU SHIYU","058578B03","SM2","SM2-RP","Single","ME"]
[null,null,null,"GAO YIBEN","058598H03","SM2","SM2-RP","Single","ENE"]
[null,null,null,"ZHOU DAPENG","058601D03","SM3","SM2-AP/SM3","Single","EEE"]
[null,null,null,"SINGH RAHUL","058628B03","SIA-NOL","No bridging","Single","EEE"]
[null,null,null,"WANG JING","058632D03","SM2","SM2-RP","Single","EEE"]
[null,null,null,"KANG QIAN","058635K03","SM2","SM2-RP","Single","EEE"]
[null,null,null,"XU MINGJIE","058646D03","SM3","SM2-AP/SM3","Single","EEE"]
[null,null,null,"LIU YAN","058683K03","SM3","SM2-AP/SM3","Single","EEE"]
[null,null,null,"NOLANG FANANI","058700F03","Direct","No bridging","Single","EEE"]
[null,null,null,"LIU SHUWEI","058703A03","SM3","SM2-AP/SM3","Single","EEE"]
[null,null,null,"ZHANG YAO","058723G03","SM3","SM2-AP/SM3","Single","EEE"]
[null,null,null,"LI QIANG","058730D03","SM2","SM2-RP","Single","ME"]
[null,null,null,"HE HONG","058741J03","SM3","SM2-AP/SM3","Single","EEE"]
[null,null,null,"ZHU YU","058743B03","SM3","SM2-AP/SM3","Single","ME"]
[null,null,null,"GUO AIFEN","058749C03","SM3","SM2-AP/SM3","Single","EEE"]
[null,null,null,"HUANG DEZHAO","058750K03","SM3","SM2-AP/SM3","Single","EEE"]
[null,null,null,"SUDHANSHU AGARWAL","058751A03","Direct","No bridging","Single","EEE"]
[null,null,null,"CUI LUCHAO","058761D03","SM3","SM2-AP/SM3","Single","BIE"]
[null,null,null,"WANG YI","058815A03","SM2","SM2-RP","Single","EEE"]
[null,null,null,"CHENG HE","058817E03","SM3","SM2-AP/SM3","Single","BIE"]
[null,null,null,"XU CONG","058823L03","SM3","SM2-AP/SM3","Single","EEE"]
[null,null,null,"WEI ZHICHENG","058847C03","SM2 (Accelerated)","SM2-AP/SM3","Single","EEE"]
[null,null,null,"KARAN KUMAR","058860F03","Direct","No bridging","Single","EEE"]
[null,null,null,"LU JIAO","058862K03","SM3","SM2-AP/SM3","Single","EEE"]
[null,null,null,"FU WENHAO","058876K03","SM2","SM2-RP","Single","CEE"]
[null,null,null,"CHEN JUNCHAO","058877A03","SM3","SM2-AP/SM3","Single","EEE"]
[null,null,null,"TIAN HUI","058881C03","SM3","SM2-AP/SM3","Single","EEE"]
[null,null,null,"YANG LIFENG","058890D03","SM3","SM2-AP/SM3","Single","EEE"]
[null,null,null,"LIU QIAN","058891F03","SM2","SM2-RP","Single","BIE"]
[null,null,null,"JIA WENPENG","058923D03","SM3","SM2-AP/SM3","Single","EEE"]
[null,null,null,"FAN YU","058938F03","SM3","SM2-AP/SM3","Single","EEE"]
[null,null,null,"LI HAIYUN","058944A03","SM2","SM2-RP","Single","EEE"]
[null,null,null,"DAGA MUKUND","058954D03","Direct","No bridging","Single","EEE"]
[null,null,null,"WANG HUILEI","058976C03","SM3","SM2-AP/SM3","Single","EEE"]
[null,null,null,"YUAN JUN","058989A03","SM3","SM2-AP/SM3","Single","BIE"]
[null,null,null,"CAI XIBIN","059000G03","SM3","SM2-AP/SM3","Single","BIE"]
[null,null,null,"PRABAL SINGH NEGI","059023H03","Direct","No bridging","Single","ME"]
[null,null,null,"HUANG LING","059039A03","SM3","SM2-AP/SM3","Single","EEE"]
[null,null,null,"YU SHANSHAN","059046J03","SM3","SM2-AP/SM3","Single","EEE"]
[null,null,null,"CHEN WEN","059049D03","SM3","SM2-AP/SM3","Single","EEE"]
[null,null,null,"YANG CHONG","059050L03","SM2 (Accelerated)","SM2-AP/SM3","Single","BIE"]
[null,null,null,"ZHU NING","059063J03","SM3","SM2-AP/SM3","Single","CEE"]
[null,null,null,"LI RENSHI","059068H03","SM3","SM2-AP/SM3","Single","EEE"]
[null,null,null,"SHEN DANQIAN","059102D03","SM3","SM2-AP/SM3","Single","ENE"]
[null,null,null,"WANG ZHENG","059103F03","SM2","SM2-RP","Single","BIE"]
[null,null,null,"LU XIAONA","059107C03","SM2","SM2-RP","Single","EEE"]
[null,null,null,"LANG XIAOLING","059120F03","SM2","SM2-RP","Single","BIE"]
[null,null,null,"LI QINGYUAN","059122K03","SM2","SM2-RP","Single","CEE"]
[null,null,null,"JIN JING","059179F03","SM3","SM2-AP/SM3","Single","EEE"]
[null,null,null,"CHEN SHIYI","059200D03","SM2 (Accelerated)","SM2-AP/SM3","Single","EEE"]
[null,null,null,"FIDELIS ADHIKA PRADIPTA LIE","059203K03","Direct","No bridging","Single","ME"]
[null,null,null,"TAUFAN RUSLI","059219C03","MOE PreU Scholar (ASEAN)","No bridging","Single","ME"]
[null,null,null,"YAN JINNA","059282K03","SM3","SM2-AP/SM3","Single","EEE"]
[null,null,null,"ABDULLAH RASMITA","059296K03","Direct","No bridging","Single","EEE"]
[null,null,null,"YAN RAN","059305G03","SM3","SM2-AP/SM3","Single","EEE"]
[null,null,null,"SUN KE","059311B03","SM3","SM2-AP/SM3","Single","ME"]
[null,null,null,"LIAO JIA","059324L03","MOE PreU Scholar (PRC)","No bridging",{"$f":"VLOOKUP(I$1:I$5281,$A$37:$B$212,2,FALSE)","v":"Single"},"EEE"]
[null,null,null,"Wang Ting","059328H03","SM3","SM2-AP/SM3","Single","EEE"]
[null,null,null,"ZHANG NING","059331H03","SM3","SM2-AP/SM3","Single","EEE"]
[null,null,null,"ZHENG JUN","059336G03","SM3","SM2-AP/SM3","Single","EEE"]
[null,null,null,"GAURAV YASHWANT SONAR","059338L03","Direct","No bridging","Single","EEE"]
[null,null,null,"VASUDEVAN PRABHAKARAN","059347A03","Direct","No bridging","Single","EEE"]
[null,null,null,"HUANG LI","059409H03","SM2","SM2-RP","Single","EEE"]
[null,null,null,"CHEN XU","059459A03","SM2","SM2-RP","Single","EEE"]
[null,null,null,"MARGASANTI WIJAYA","059461K03","Direct","No bridging","Single","EEE"]
[null,null,null,"HAN LIANG","059463C03","SM2","SM2-RP","Single","EEE"]
[null,null,null,"ZHAO BING","059476A03","SM2","SM2-RP","Single","CEE"]
[null,null,null,"LI BING","059495E03","SM3","SM2-AP/SM3","Single","CEE"]
[null,null,null,"PANG YUANCHEN","059515G03","SM2","SM2-RP","Single","EEE"]
[null,null,null,"QIN JINJING","059519D03","SM3","SM2-AP/SM3","Single","EEE"]
[null,null,null,"AVIJEET SEN","059520L03","SIA-NOL","No bridging","Single","EEE"]
[null,null,null,"CHEN MIN","059533J03","SM3","SM2-AP/SM3","Single","EEE"]
[null,null,null,"JI WENBIN","059558C03","SM2","SM2-RP","Single","EEE"]
[null,null,null,"WEI WENTING","059559E03","SM2","SM2-RP","Single","EEE"]
[null,null,null,"TIAN JING","059569H03","SM3","SM2-AP/SM3","Single","EEE"]
[null,null,null,"DONG BIN","059573K03","SM3","SM2-AP/SM3","Single","EEE"]
[null,null,null,"LIU FEIPENG","059598D03","SM3","SM2-AP/SM3","Single","EEE"]
[null,null,null,"WANG YI","059612E03","SM3","SM2-AP/SM3","Single","EEE"]
[null,null,null,"Kailasam Parvathy","059662J03","SIA Youth","No bridging","Single","EEE"]
[null,null,null,"LIU JIANGLAN","059664B03","SM2","SM2-RP","Single","EEE"]
[null,null,null,"YANG JIE","059695B03","MOE PreU Scholar (PRC)","No bridging","Single","EEE"]
[null,null,null,"OUYANG SHIXIAO","059699K03","SM2","SM2-RP","Single","EEE"]
[null,null,null,"MANIK DUA","059716F03","Direct","No bridging","Single","EEE"]
[null,null,null,"ZHAO KUIFENG","059728B03","SM3","SM2-AP/SM3","Single","ENE"]
[null,null,null,"BHUVAN SHRIVASTAVA","059730L03","Direct","No bridging","Single","EEE"]
[null,null,null,"JIANG KAI","059740C03","SM2 (Accelerated)","SM2-AP/SM3","Single","EEE"]
[null,null,null,"LI RUI","059755E03","MOE PreU Scholar (PRC)","No bridging","Single","EEE"]
[null,null,null,"ZHENG GUANGLEI","059760J03","SM2","SM2-RP","Single","EEE"]
[null,null,null,"LI PENG","059783K03","SM3","SM2-AP/SM3","Single","EEE"]
[null,null,null,"JI YUN","059789L03","SM3","SM2-AP/SM3","Single","EEE"]
[null,null,null,"JI QIANG","059798A03","SM2","SM2-RP","Single","EEE"]
[null,null,null,"PENG LEI","059801H03","SM2","SM2-RP","Single","EEE"]
[null,null,null,"YAO CHEN","059815H03","SM2","SM2-RP","Single","EEE"]
[null,null,null,"MO WEI","059831F03","SM3","SM2-AP/SM3","Single","EEE"]
[null,null,null,"ZHANG YI","059832H03","SM3","SM2-AP/SM3","Single","EEE"]
[null,null,null,"BOBBY TANTRI","059855J03","MOE PreU Scholar (ASEAN)","No bridging","Single","BIE"]
[null,null,null,"BALAM KRISHNAKANTH","059858D03","Direct","No bridging","Single","EEE"]
[null,null,null,"LI MENG","059908D03","SM3","SM2-AP/SM3","Single","BIE"]
[null,null,null,"ZHUO JIALI","060112H02","SM2","SM2-RP","Single","CBE"]
[null,null,null,"LUO DANLIN","060119L02","SM2","SM2-RP","Single","CBE"]
[null,null,null,"WELLY RICHARTIO","060157H02","Sembcorp","No bridging","Single","CBE"]
[null,null,null,"CHEN ZHENGYU","060158K02","SM2","SM2-RP","Single","CBE"]
[null,null,null,"LIU XUAN","060173F02","SM3","SM2-AP/SM3","Single","CBE"]
[null,null,null,"HAZARKI YAOHARI","060271F02","Sembcorp","No bridging","Single","CBE"]
[null,null,null,"ZHANG CHUNYAN","060300J02","SM2","SM2-RP","Single","CBE"]
[null,null,null,"YANG SHUAI","060310H07","SM2","SM2-RP","Single","MAT"]
[null,null,null,"LENG BING","060330C07","SM3","SM2-AP/SM3","Single","MAT"]
[null,null,null,"MENG QINGRUI","060338H07","SM3","SM2-AP/SM3","Single","MAT"]
[null,null,null,"XU CHEN","060354F07","SM3","SM2-AP/SM3","Single","MAT"]
[null,null,null,"YE QIAO","060360A07","SM2","SM2-RP","Single","MAT"]
[null,null,null,"ZHANG BEIBEI","060364J07","SM3","SM2-AP/SM3","Single","MAT"]
[null,null,null,"MARIA REGINA HARTONO","060365L07","Sembcorp","No bridging","Single","MAT"]
[null,null,null,"XU XIAOFENG","060368F07","SM3","SM2-AP/SM3","Single","MAT"]
[null,null,null,"LIU JING","060375C07","SM3","SM2-AP/SM3","Single","MAT"]
[null,null,null,"HUANG LUYAO","060385F07","SM3","SM2-AP/SM3","Single","MAT"]
[null,null,null,"ZHAO JUNNAN","060388A07","SM3","SM2-AP/SM3","Single","MAT"]
[null,null,null,"VIVEK BAHETI","060390K07","SIA-NOL","No bridging","Single","MAT"]
[null,null,null,"DENG LU","060392C07","SM2","SM2-RP","Single","MAT"]
[null,null,null,"WANG MENGXI","060395J07","SM2","SM2-RP","Single","MAT"]
[null,null,null,"ZHOU TING","060411C07","SM3","SM2-AP/SM3","Single","MAT"]
[null,null,null,"CHEN QIANG","060419H07","SM3","SM2-AP/SM3",{"$f":"VLOOKUP(I$1:I$5281,$A$37:$B$212,2,FALSE)","v":"Single"},"MAT"]
[null,null,null,"CHEN ZHIZHOU","060421F07","SM3","SM2-AP/SM3","Single","MAT"]
[null,null,null,"JIN YAN","060432L07","SM3","SM2-AP/SM3","Single","MAT"]
[null,null,null,"SUN JUAN","060438A07","SM3","SM2-AP/SM3","Single","MAT"]
[null,null,null,"LUO BAIWEN","060440K07","SM3","SM2-AP/SM3","Single","MAT"]
[null,null,null,"FANG WENJING","060442C07","SM3","SM2-AP/SM3","Single","MAT"]
[null,null,null,"WANG XIANG","060445J07","SM2","SM2-RP","Single","MAT"]
[null,null,null,"CONG ZELONG","060448D07","SM3","SM2-AP/SM3","Single","MAT"]
[null,null,null,"LI YONGMEI","060455A07","SM2","SM2-RP","Single","MAT"]
[null,null,null,"LI JIA","060465D07","SM3","SM2-AP/SM3","Single","MAT"]
[null,null,null,"CAI FEI","060481B07","SM3","SM2-AP/SM3","Single","MAT"]
[null,null,null,"YAO XIAOFENG","060484H07","SM3","SM2-AP/SM3","Single","MAT"]
[null,null,null,"MU JINZHAO","060488E07","SM2","SM2-RP","Single","MAT"]
[null,null,null,"ZHANG SHUAI","060505A07","SM3","SM2-AP/SM3","Single","MAT"]
[null,null,null,"ZHANG LEI","060506C07","SM3","SM2-AP/SM3","Single","MAT"]
[null,null,null,"ISABELLA MANTINI HALIM","060515D07","Sembcorp","No bridging","Single","MAT"]
[null,null,null,"DING ZEJUN","060516F07","SM2","SM2-RP","Single","MAT"]
[null,null,null,"XIA YU","060818E11","SM2","SM2-RP","Single","BS"]
[null,null,null,"WEI XIN","060864A11","SM2 (Accelerated)","SM2-AP/SM3","Single","BS"]
[null,null,null,"LIN XIAOTIAN","060913K11","SM3","SM2-AP/SM3","Single","BS"]
[null,null,null,"LI SHENGJIN","060933E11","SM2","SM2-RP","Single","BS"]
[null,null,null,"ZHANG SIMIN","061017L11","SM2","SM2-RP","Single","BS"]
[null,null,null,"RENATA TRIANI","061060A11","Sembcorp","No bridging","Single","BS"]
[null,null,null,"ZHAO XUMIN","061081J11","SM2","SM2-RP","Single","BS"]
[null,null,null,"CHEN CHEN","061097B11","SM3","SM2-AP/SM3","Single","BS"]
[null,null,null,"ZHAO YONGQIAN","061115L11","SM3","SM2-AP/SM3","Single","BS"]
[null,null,null,"ZHANG WENTAO","061126E11","SM2","SM2-RP","Single","BS"]
[null,null,null,"WANG FANG","061155A11","SM2","SM2-RP","Single","BS"]
[null,null,null,"CAI HUI","061174E11","SM2 (Accelerated)","SM2-AP/SM3","Single","BS"]
[null,null,null,"ZHANG TONG","061214B11","SM3","SM2-AP/SM3","Single","BS"]
[null,null,null,"LI MINGHAO","061223C11","SM3","SM2-AP/SM3","Single","BS"]
[null,null,null,"LIU XIAOHU","061244L11","SM3","SM2-AP/SM3","Single","BS"]
[null,null,null,"DIAZ ADI UTAMA","061292L11","Sembcorp","No bridging","Single","BS"]
[null,null,null,"CUI YIFANG","061306J14","SM2","SM2-RP","Single","MS"]
[null,null,null,"Yin Yilin","061312D14","SM3","SM2-AP/SM3","Single","MS"]
[null,null,null,"LI SUJIE","061315K14","SM2","SM2-RP","Single","MS"]
[null,null,null,"LI SHENGNAN","061316A14","SM3","SM2-AP/SM3","Single","MS"]
[null,null,null,"HUANG MIN","061321E14","SM2","SM2-RP","Single","MS"]
[null,null,null,"ZHENG YANCHAO","061328H14","SM2","SM2-RP","Single","MS"]
[null,null,null,"WANG XIAO","061331H14","SM2","SM2-RP","Single","MS"]
[null,null,null,"ZHANG YINGYING","061345H14","SM3","SM2-AP/SM3","Single","MS"]
[null,null,null,"ZHENG ENCEN","061357D14","SM2","SM2-RP","Single","MS"]
[null,null,null,"HUANG RUIXIANG","061399F15","SM2","SM2-RP","Single","AERO"]
[null,null,null,"JIN HANFENG","061421F15","SM3","SM2-AP/SM3","Single","AERO"]
[null,null,null,"WANG HAO","061430G15","SM3","SM2-AP/SM3","Single","AERO"]
[null,null,null,"YU LU","061577D15","SM2 (Accelerated)","SM2-AP/SM3","Single","AERO"]
[null,null,null,"PARVATHY PREM","061587G15","SIA-NOL","No bridging","Single","AERO"]
[null,null,null,"CAO JING","061831B19","SM2 (Accelerated)","SM2-AP/SM3","Single","BIE"]
[null,null,null,"HUANG SIHUA","061864F19","SM2 (Accelerated)","SM2-AP/SM3","Single","BIE"]
[null,null,null,"ISHITA BINDAL","061888J19","SIA-NOL","No bridging","Single","BIE"]
[null,null,null,"LIU JI","061917A19","SM2 (Accelerated)","SM2-AP/SM3","Single","BIE"]
[null,null,null,"GAO ZHIMING","063052A16","SM2","SM2-RP","Single","CHEM"]
[null,null,null,"PAN MING","063064H16","SM3","SM2-AP/SM3","Single","CHEM"]
[null,null,null,"DENG CHUNHUI","063067C16","SM2","SM2-RP","Single","CHEM"]
[null,null,null,"JU XIAO","063112D16","SM3","SM2-AP/SM3","Single","PHY"]
[null,null,null,"ZHANG YI","063120C16","SM2","SM2-RP","Single","CHEM"]
[null,null,null,"ZHANG XU","063126D16","SM2","SM2-RP","Single","MATH"]
[null,null,null,"MA RUICHAO","063127F16","SM2 (Accelerated)","SM2-AP/SM3","Single","PHY"]
[null,null,null,"ZHAO GUANJIA","063153G16","SM3","SM2-AP/SM3","Single","CHEM"]
[null,null,null,"XIANG GANSHENG","063163K16","SM3","SM2-AP/SM3","Single","PHY"]
[null,null,null,"WU JIAWEN","063177K16","SM2","SM2-RP","Single","CHEM"]
[null,null,null,"ZHANG FENGTIAN","063224D16","SM3","SM2-AP/SM3","Single","MATH"]
[null,null,null,"SEPTIAN BUDI WALUYAN","063268B16","Sembcorp","No bridging","Single","PHY"]
[null,null,null,"LI SUCHUN","063272D16","SM3","SM2-AP/SM3","Single","PHY"]
[null,null,null,"FAN XIAOXIA","063328E16","SM2","SM2-RP",{"$f":"VLOOKUP(I$1:I$5281,$A$37:$B$212,2,FALSE)","v":"Single"},"CHEM"]
[null,null,null,"HUANG YINGYING","063333J16","SM2","SM2-RP","Single","CHEM"]
[null,null,null,"HAN LING","063352B16","SM2","SM2-RP","Single","CHEM"]
[null,null,null,"CHEN RONG","063362E16","SM2","SM2-RP","Single","MATH"]
[null,null,null,"CHENG XUEFEI","063391A16","SM3","SM2-AP/SM3","Single","CHEM"]
[null,null,null,"LUO XIAOZHOU","063406K16","SM3","SM2-AP/SM3","Single","CHEM"]
[null,null,null,"SU LE","063452F16","SM2","SM2-RP","Single","MATH"]
[null,null,null,"FAN YANLIANG","063463L16","SM2","SM2-RP","Single","CHEM"]
[null,null,null,"LIAN CHAO","063558L16","SM3","SM2-AP/SM3","Single","CHEM"]
[null,null,null,"ZHANG XUAN","063589L16","SM2","SM2-RP","Single","CHEM"]
[null,null,null,"JIN MENGYI","063596H16","SM2","SM2-RP","Single","CHEM"]
[null,null,null,"WANG YAWEN","063603A16","SM2","SM2-RP","Single","CHEM"]
[null,null,null,"TENG LEI","063612B16","SM2","SM2-RP","Single","MATH"]
[null,null,null,"CHRISTINE","063650K16","Sembcorp","No bridging","Single","MATH"]
[null,null,null,"HUA XIA","063655J16","SM2","SM2-RP","Single","MATH"]
[null,null,null,"BAI YAGUANG","063684E16","SM3","SM2-AP/SM3","Single","CHEM"]
[null,null,null,"GUNVEET BATRA","064927C06","SIA-NOL","No bridging","Single","CE"]
[null,null,null,"LIU YING","064942K06","SM3","SM2-AP/SM3","Single","CE"]
[null,null,null,"HE LU","064947J06","SM3","SM2-AP/SM3","Single","CE"]
[null,null,null,"YANG WUJUN","064955H06","MOE PreU Scholar (PRC)","No bridging","Single","CE"]
[null,null,null,"LI XIAOWEI","064960A06","SM2","SM2-RP","Single","CE"]
[null,null,null,"XIONG SIYU","064973K06","SM2","SM2-RP","Single","CE"]
[null,null,null,"LENG QUAN","064997B06","SM3","SM2-AP/SM3","Single","CE"]
[null,null,null,"GAUTAM RAO","065001L06","SIA-NOL","No bridging","Single","CE"]
[null,null,null,"LIU YAO","065036H06","SM3","SM2-AP/SM3","Single","CE"]
[null,null,null,"LI YIWEN","065056C06","SM3","SM2-AP/SM3","Single","CSC"]
[null,null,null,"NIRAJ","065078B06","SIA-NOL","No bridging","Single","CE"]
[null,null,null,"WANG KAIWEN","065085K06","SM2","SM2-RP","Single","CE"]
[null,null,null,"SUN CHAO","065089G06","SM3","SM2-AP/SM3","Single","CE"]
[null,null,null,"ZHONG YUAN","065102F06","SM2","SM2-RP","Single","CE"]
[null,null,null,"WANG GAO","065106C06","SM3","SM2-AP/SM3","Single","CE"]
[null,null,null,"SHU HAOJIANG","065109J06","SM2","SM2-RP","Single","CE"]
[null,null,null,"HUANG LELUN","065128B06","SM2","SM2-RP","Single","CE"]
[null,null,null,"KARTINI MULYADI","065144L06","Sembcorp","No bridging","Single","CSC"]
[null,null,null,"SUN ZHONGYINAN","065146D06","SM2","SM2-RP","Single","CSC"]
[null,null,null,"WENG YAO","065150F06","SM2","SM2-RP","Single","CE"]
[null,null,null,"SHREY JAIN","065151H06","SIA-NOL","No bridging","Single","CE"]
[null,null,null,"MUHAMMAD KHADAFI","065175L06","Sembcorp","No bridging","Single","CSC"]
[null,null,null,"QU XI","065183K06","SM3","SM2-AP/SM3","Single","CE"]
[null,null,null,"HAMDANIL RASYID","065194D06","Sembcorp","No bridging","Single","CE"]
[null,null,null,"XU YI","065205E06","SM3","SM2-AP/SM3","Single","CE"]
[null,null,null,"WANG HUI","065206G06","SM3","SM2-AP/SM3","Single","CE"]
[null,null,null,"GONG YIFAN","065212B06","SM3","SM2-AP/SM3","Single","CE"]
[null,null,null,"QIAN XIAOFENG","065223G06","SM3","SM2-AP/SM3","Single","CSC"]
[null,null,null,"VAISAGH VISWANATHAN THATTAMPARAMBIL","065236E06","SIA-NOL","No bridging","Single","CE"]
[null,null,null,"MANVEEN KAUR","065281K06","SIA-NOL","No bridging","Single","CE"]
[null,null,null,"ISHITA PRIYAL","065295K06","SIA-NOL","No bridging","Single","CE"]
[null,null,null,"RAHUL MEHNDIRATTA","065296A06","Direct","No bridging","Single","CE"]
[null,null,null,"XIA WENWEN","065306L06","SM3","SM2-AP/SM3","Single","CE"]
[null,null,null,"SHREYANS RAI JAIN","065308D06","SIA-NOL","No bridging","Single","CE"]
[null,null,null,"CHEN SHAOZHUANG","065312F06","SM3","SM2-AP/SM3","Single","CE"]
[null,null,null,"ZHANG HAO","065316C06","SM3","SM2-AP/SM3","Single","CE"]
[null,null,null,"ZHANG KAIBIN","065327H06","SM3","SM2-AP/SM3","Single","CE"]
[null,null,null,"WEN ZHENG","065341B06","SM3","SM2-AP/SM3","Single","CE"]
[null,null,null,"HEZRON FREDDY MANURUNG","065346A06","Sembcorp","No bridging","Single","CE"]
[null,null,null,"SU QIN","065366G06","SM3","SM2-AP/SM3","Single","CSC"]
[null,null,null,"LI HUI","065382E06","SM2","SM2-RP","Single","CE"]
[null,null,null,"ADRIAN ISKANDAR","065392H06","Sembcorp","No bridging","Single","CE"]
[null,null,null,"SULABH MADHWAL","067166L03","SIA-NOL","No bridging","Single","ME"]
[null,null,null,"YANG SHIYI","067172F03","SM2","SM2-RP","Single","EEE"]
[null,null,null,"MA JI","067203B03","SM2","SM2-RP","Single","ME"]
[null,null,null,"YE SHUQIN","067224K03","SM2","SM2-RP","Single","EEE"]
[null,null,null,"LI SHASHA","067227E03","SM2","SM2-RP","Single","EEE"]
[null,null,null,"WANG RUOXI","067288C03","SM3","SM2-AP/SM3","Single","EEE"]
[null,null,null,"SUN LEI","067321H03","SM3","SM2-AP/SM3",{"$f":"VLOOKUP(I$1:I$5281,$A$37:$B$212,2,FALSE)","v":"Single"},"EEE"]
[null,null,null,"ADI DAHIYA","067332B03","SIA-NOL","No bridging","Single","EEE"]
[null,null,null,"ZHANG CHEN","067339E03","SM2 (Accelerated)","SM2-AP/SM3","Single","EEE"]
[null,null,null,"DONG FENG","067365F03","SM2","SM2-RP","Single","EEE"]
[null,null,null,"LUO QIONG","067403K03","SM3","SM2-AP/SM3","Single","EEE"]
[null,null,null,"LI YAO","067407G03","SM3","SM2-AP/SM3","Single","EEE"]
[null,null,null,"JIE NANNAN","067408J03","SM3","SM2-AP/SM3","Single","EEE"]
[null,null,null,"GUI LIN","067424G03","SM2","SM2-RP","Single","EEE"]
[null,null,null,"JIA HAO","067431D03","SM3","SM2-AP/SM3","Single","EEE"]
[null,null,null,"LU YANG","067443L03","SM3","SM2-AP/SM3","Single","ME"]
[null,null,null,"LITA","067481H03","MOE PreU Scholar (ASEAN)","No bridging","Single","ENE"]
[null,null,null,"WANG LIYONG","067505G03","SM2","SM2-RP","Single","EEE"]
[null,null,null,"CHEN FANGYING","067510L03","SM3","SM2-AP/SM3","Single","EEE"]
[null,null,null,"VIKRAM BAHL","067511B03","SIA-NOL","No bridging","Single","EEE"]
[null,null,null,"WANG LAOHU","067519G03","SM2","SM2-RP","Single","ME"]
[null,null,null,"WANG WENFENG","067545H03","SM3","SM2-AP/SM3","Single","CEE"]
[null,null,null,"DAI LIJUN","067549E03","SM3","SM2-AP/SM3","Single","EEE"]
[null,null,null,"ZHANG LI","067551C03","SM3","SM2-AP/SM3","Single","EEE"]
[null,null,null,"HE PAN","067573B03","SM2 (Accelerated)","SM2-AP/SM3","Single","EEE"]
[null,null,null,"XUE QI","067595A03","SM2 (Accelerated)","SM2-AP/SM3","Single","EEE"]
[null,null,null,"SHEKHAR GUPTA","067607D03","SIA-NOL","No bridging","Single","EEE"]
[null,null,null,"AN SHUAICHEN","067622L03","SM3","SM2-AP/SM3","Single","ME"]
[null,null,null,"LI SHANSHAN","067641D03","SM2","SM2-RP","Single","ME"]
[null,null,null,"ZHENG MEIHONG","067653L03","SM3","SM2-AP/SM3","Single","EEE"]
[null,null,null,"WANG GANG","067654B03","SM3","SM2-AP/SM3","Single","EEE"]
[null,null,null,"MICHAEL SANJAYA WIRA","067674H03","Sembcorp","No bridging","Single","ME"]
[null,null,null,"BENAGA VIRGANTARA","067702J03","Sembcorp","No bridging","Single","EEE"]
[null,null,null,"YANG FANG","067749B03","SM2","SM2-RP","Single","EEE"]
[null,null,null,"LI DONGRUI","067753D03","SM3","SM2-AP/SM3","Single","EEE"]
[null,null,null,"LIN BIWEI","067767D03","SM3","SM2-AP/SM3","Single","EEE"]
[null,null,null,"ZHU MING","067781J03","SM2","SM2-RP","Single","EEE"]
[null,null,null,"HU CHEN","067783B03","SM3","SM2-AP/SM3","Single","EEE"]
[null,null,null,"WANG HAO","067785F03","SM3","SM2-AP/SM3","Single","EEE"]
[null,null,null,"HE JI","067809E03","SM2 (Accelerated)","SM2-AP/SM3","Single","EEE"]
[null,null,null,"CHEN MENGLI","067814J03","SM2","SM2-RP","Single","ENE"]
[null,null,null,"LUO JIAYU","067825C03","SM2","SM2-RP","Single","EEE"]
[null,null,null,"LUAN QIANQIAN","067831J03","SM2","SM2-RP","Single","EEE"]
[null,null,null,"RAHUL AGRAWAL","067833B03","SIA-NOL","No bridging","Single","EEE"]
[null,null,null,"YANG XI","067838A03","SM2 (Accelerated)","SM2-AP/SM3","Single","EEE"]
[null,null,null,"MING ZHENZHEN","067840K03","SM3","SM2-AP/SM3","Single","ME"]
[null,null,null,"GU KAI","067842C03","SM3","SM2-AP/SM3","Single","EEE"]
[null,null,null,"WANG HUISHEN","067843E03","SM3","SM2-AP/SM3","Single","EEE"]
[null,null,null,"SUN SHUO","067870H03","SM3","SM2-AP/SM3","Single","EEE"]
[null,null,null,"WU YANG","067893J03","SM3","SM2-AP/SM3","Single","EEE"]
[null,null,null,"WANG XIAOLE","067931B03","SM2","SM2-RP","Single","EEE"]
[null,null,null,"XU MUFENG","067935K03","SM3","SM2-AP/SM3","Single","EEE"]
[null,null,null,"WANG FEI","067936A03","SM2","SM2-RP","Single","EEE"]
[null,null,null,"WANG RENZHE","067947F03","SM2","SM2-RP","Single","EEE"]
[null,null,null,"GAURAV TEWARY","067954C03","SIA-NOL","No bridging","Single","EEE"]
[null,null,null,"WANG HAO","067969E03","SM3","SM2-AP/SM3","Single","EEE"]
[null,null,null,"TAN HUA","067985C03","SM3","SM2-AP/SM3","Single","EEE"]
[null,null,null,"XIE WEI","067994D03","SM2","SM2-RP","Single","ME"]
[null,null,null,"XIAO XU","068015H03","SM3","SM2-AP/SM3","Single","EEE"]
[null,null,null,"YU YAXIN","068017A03","SM2 (Accelerated)","SM2-AP/SM3","Single","EEE"]
[null,null,null,"LI CHENGHAN","068029H03","SM3","SM2-AP/SM3","Single","EEE"]
[null,null,null,"OUYANG LILI","068035C03","SM2","SM2-RP","Single","EEE"]
[null,null,null,"LI GUOLIANG","068038J03","SM2","SM2-RP","Single","ENE"]
[null,null,null,"WEI JUN","068046H03","SM3","SM2-AP/SM3","Single","ME"]
[null,null,null,"ZHAO LU","068052C03","SM3","SM2-AP/SM3","Single","EEE"]
[null,null,null,"LI JUN","068053E03","SM3","SM2-AP/SM3","Single","ME"]
[null,null,null,"KUCHIBHOTLA TEJA","068054G03","SIA-NOL","No bridging","Single","ME"]
[null,null,null,"DU RUOGU","068056L03","SM3","SM2-AP/SM3","Single","EEE"]
[null,null,null,"SHANTANU SINGH","068063H03","SIA-NOL","No bridging","Single","EEE"]
[null,null,null,"Li Shangyuan","068081K03","SM3","SM2-AP/SM3","Single","ME"]
[null,null,null,"YANG XIAOLU","068087L03","SM2","SM2-RP",{"$f":"VLOOKUP(I$1:I$5281,$A$37:$B$212,2,FALSE)","v":"Single"},"EEE"]
[null,null,null,"JIANG HUA","068092D03","SM3","SM2-AP/SM3","Single","EEE"]
[null,null,null,"CAO LUYAN","068151E03","SM2","SM2-RP","Single","EEE"]
[null,null,null,"HUANG YULI","068189H03","SM2","SM2-RP","Single","ME"]
[null,null,null,"SAURABH SINGH PAL","068193K03","SIA-NOL","No bridging","Single","EEE"]
[null,null,null,"HUANG QINGYIN","068207F03","SM2","SM2-RP","Single","EEE"]
[null,null,null,"GENG HANHE","068219B03","SM3","SM2-AP/SM3","Single","EEE"]
[null,null,null,"SUTHAGAR RAGHUL","068225H03","SIA-NOL","No bridging","Single","EEE"]
[null,null,null,"ANINDYA DUTTA","068235L03","SIA-NOL","No bridging","Single","EEE"]
[null,null,null,"ZHU JING","068270B03","SM3","SM2-AP/SM3","Single","ME"]
[null,null,null,"ZHANG PENGFEI","068296J03","SM3","SM2-AP/SM3","Single","EEE"]
[null,null,null,"LI ZHENGJIE","068302L03","SM3","SM2-AP/SM3","Single","EEE"]
[null,null,null,"DESAI DHYEY NAREN","068304D03","SIA-NOL","No bridging","Single","EEE"]
[null,null,null,"ZHOU KAIJING","068313E03","SM3","SM2-AP/SM3","Single","EEE"]
[null,null,null,"JI HENG","068352D03","SM3","SM2-AP/SM3","Single","EEE"]
[null,null,null,"WANG SHIKAI","068355K03","SM3","SM2-AP/SM3","Single","EEE"]
[null,null,null,"ZHANG HAO","068367F03","SM2","SM2-RP","Single","EEE"]
[null,null,null,"WANG WEI","068381L03","SM3","SM2-AP/SM3","Single","EEE"]
[null,null,null,"HONG CHAO","068424C03","SM3","SM2-AP/SM3","Single","EEE"]
[null,null,null,"NIE ZHENZHI","068451F03","SM2","SM2-RP","Single","EEE"]
[null,null,null,"LI JIA","068478D03","SM3","SM2-AP/SM3","Single","EEE"]
[null,null,null,"YANG XIAO","068488G03","SM2","SM2-RP","Single","EEE"]
[null,null,null,"LI QI","068511J03","SM3","SM2-AP/SM3","Single","EEE"]
[null,null,null,"SHAO SHUAI","068515F03","SM3","SM2-AP/SM3","Single","EEE"]
[null,null,null,"XU LIBING","068528D03","SM3","SM2-AP/SM3","Single","ME"]
[null,null,null,"ZHANG XIAOYUE","068536C03","SM2","SM2-RP","Single","ENE"]
[null,null,null,"JIAO BO","068564H03","SM3","SM2-AP/SM3","Single","EEE"]
[null,null,null,"SAUMYA DEEP DATTA","068609D03","SIA-NOL","No bridging","Single","EEE"]
[null,null,null,"WANG LU","068611B03","SM2","SM2-RP","Single","EEE"]
[null,null,null,"XUAN ZHIYANG","068629K03","SM2","SM2-RP","Single","EEE"]
[null,null,null,"SIDDHARTH TRIVEDI","068636G03","SIA-NOL","No bridging","Single","EEE"]
[null,null,null,"ZHONG HUA","068641L03","SM2","SM2-RP","Single","EEE"]
[null,null,null,"JANUARDY DJONG","068655L03","Sembcorp","No bridging","Single","ME"]
[null,null,null,"WANG JUNLING","068681A03","SM3","SM2-AP/SM3","Single","EEE"]
[null,null,null,"LIN YONGXIANG","068692F03","SM3","SM2-AP/SM3","Single","CEE"]
[null,null,null,"XIONG WEI","068698G03","SM3","SM2-AP/SM3","Single","EEE"]
[null,null,null,"LI HE","068700A03","SM2","SM2-RP","Single","ME"]
[null,null,null,"WANG KUNFENG","068703G03","SM3","SM2-AP/SM3","Single","ME"]
[null,null,null,"LI LEI","068722L03","SM3","SM2-AP/SM3","Single","ME"]
[null,null,null,"YANG WENXIN","068736L03","SM3","SM2-AP/SM3","Single","EEE"]
[null,null,null,"LI TIAN","068744K03","SM2","SM2-RP","Single","ME"]
[null,null,null,"ZHOU LIE","068762A03","SM3","SM2-AP/SM3","Single","EEE"]
[null,null,null,"TONG FEI","068781E03","SM3","SM2-AP/SM3","Single","EEE"]
[null,null,null,"WANG YOULONG","068804B03","SM3","SM2-AP/SM3","Single","ME"]
[null,null,null,"ZHANG CHENGCHENG","068807H03","SM3","SM2-AP/SM3","Single","EEE"]
[null,null,null,"MENG LEI","068834L03","SM2","SM2-RP","Single","EEE"]
[null,null,null,"ZHOU YANYAN","068864J03","SM2","SM2-RP","Single","EEE"]
[null,null,null,"XIAO DEZHONG","068877G03","SM2","SM2-RP","Single","ENE"]
[null,null,null,"HAN MENGTONG","068888A03","SM2 (Accelerated)","SM2-AP/SM3","Single","EEE"]
[null,null,null,"LIU XIAN","068920D03","SM2","SM2-RP","Single","EEE"]
[null,null,null,"CUI MIN","068925C03","SM2","SM2-RP","Single","EEE"]
[null,null,null,"LIU SHUO","068930G03","SM3","SM2-AP/SM3","Single","EEE"]
[null,null,null,"LI YIYANG","068945J03","SM3","SM2-AP/SM3","Single","EEE"]
[null,null,null,"ZENG XUDONG","068946L03","SM3","SM2-AP/SM3","Single","ME"]
[null,null,null,"YANG YANG","068980L03","SM2","SM2-RP","Single","EEE"]
[null,null,null,"JI QING","068999K03","SM2 (Accelerated)","SM2-AP/SM3","Single","EEE"]
[null,null,null,"WEN XIANGCHUN","069019A03","SM3","SM2-AP/SM3","Single","EEE"]
[null,null,null,"GUO MENG","069059B03","SM2","SM2-RP","Single","EEE"]
[null,null,null,"HE MAOYING","069066K03","SM2","SM2-RP","Single","EEE"]
[null,null,null,"GUO LINFEI","069081F03","SM3","SM2-AP/SM3","Single","EEE"]
[null,null,null,"EDWARD LUPITO","069108L03","Sembcorp","No bridging","Single","EEE"]
[null,null,null,"LIANG HONGYAO","069115H03","SM2 (Accelerated)","SM2-AP/SM3","Single","EEE"]
[null,null,null,"MARUVANDA AIYAPPA CHENGAPPA","069185G03","SIA-NOL","No bridging","Single","EEE"]
[null,null,null,"GAO PENGFEI","069239D03","SM3","SM2-AP/SM3","Single","EEE"]
[null,null,null,"MO YANTING","069240L03","SM3","SM2-AP/SM3",{"$f":"VLOOKUP(I$1:I$5281,$A$37:$B$212,2,FALSE)","v":"Single"},"EEE"]
[null,null,null,"GU YANGSHUO","069265E03","SM2","SM2-RP","Single","ENE"]
[null,null,null,"MURNI HASAN","069273D03","Sembcorp","No bridging","Single","EEE"]
[null,null,null,"LUO WUQIONG","069289H03","SM3","SM2-AP/SM3","Single","EEE"]
[null,null,null,"SUN BO","069292H03","SM3","SM2-AP/SM3","Single","EEE"]
[null,null,null,"LIU YAN","069297G03","SM2","SM2-RP","Single","EEE"]
[null,null,null,"SUN HUIYUAN","069306D03","SM3","SM2-AP/SM3","Single","EEE"]
[null,null,null,"YANG QIAN","069316G03","SM2","SM2-RP","Single","EEE"]
[null,null,null,"DUAN BO","069321L03","SM3","SM2-AP/SM3","Single","ENE"]
[null,null,null,"DEEPAN MALIK","069323D03","SIA-NOL","No bridging","Single","EEE"]
[null,null,null,"YUAN HE","069334J03","SM3","SM2-AP/SM3","Single","ME"]
[null,null,null,"YANG SHU","069342H03","SM2","SM2-RP","Single","EEE"]
[null,null,null,"LI XIAOLIANG","069346E03","SM3","SM2-AP/SM3","Single","EEE"]
[null,null,null,"GUAN MINGTAO","069364G03","SM2","SM2-RP","Single","EEE"]
[null,null,null,"CUI DAWEI","069374K03","SM2 (Accelerated)","SM2-AP/SM3","Single","EEE"]
[null,null,null,"DUAN PIZHU","069378G03","SM3","SM2-AP/SM3","Single","EEE"]
[null,null,null,"LIU SHAOTAO","069398B03","SM3","SM2-AP/SM3","Single","EEE"]
[null,null,null,"TAN SICONG","069413E03","SM2","SM2-RP","Single","EEE"]
[null,null,null,"YU YOU","069416L03","SM2","SM2-RP","Single","ME"]
[null,null,null,"XIE YIN","069421D03","SM2","SM2-RP","Single","EEE"]
[null,null,null,"ZOU YOU","069432J03","SM3","SM2-AP/SM3","Single","EEE"]
[null,null,null,"JI TUO","069445G03","SM2","SM2-RP","Single","EEE"]
[null,null,null,"ZHANG ANSEN","069453F03","SM3","SM2-AP/SM3","Single","EEE"]
[null,null,null,"JAIDEEP SINGH","069474C03","SIA-NOL","No bridging","Single","EEE"]
[null,null,null,"SHENG XIUJUAN","069487A03","SM3","SM2-AP/SM3","Single","EEE"]
[null,null,null,"MA QINGQIANG","069488C03","SM3","SM2-AP/SM3","Single","EEE"]
[null,null,null,"HU ZE","069512G03","SM3","SM2-AP/SM3","Single","EEE"]
[null,null,null,"WU FEI","069515B03","SM3","SM2-AP/SM3","Single","EEE"]
[null,null,null,"HE SHU","069523A03","SM2","SM2-RP","Single","ME"]
[null,null,null,"JING WEI","069541C03","SM3","SM2-AP/SM3","Single","EEE"]
[null,null,null,"WEI YAZHE","069562L03","SM2","SM2-RP","Single","EEE"]
[null,null,null,"LI YIHU","069600D03","SM2","SM2-RP","Single","EEE"]
[null,null,null,"YING HAO","069630B03","SM3","SM2-AP/SM3","Single","EEE"]
[null,null,null,"YU KUN","069633H03","SM2","SM2-RP","Single","EEE"]
[null,null,null,"ZHA XIAODONG","069638G03","SM3","SM2-AP/SM3","Single","EEE"]
[null,null,null,"TANG PENG","069645D03","SM3","SM2-AP/SM3","Single","EEE"]
[null,null,null,"KEVIN HANDAYA","069649A03","Sembcorp","No bridging","Single","EEE"]
[null,null,null,"LI HAILIN","069661B03","SM3","SM2-AP/SM3","Single","EEE"]
[null,null,null,"ZHOU SEN","069667C03","SM3","SM2-AP/SM3","Single","EEE"]
[null,null,null,"ADE HARTAWAN JOHAN, SANTOSO","069669G03","Sembcorp","No bridging","Single","ME"]
[null,null,null,"ZHANG YAN","069699E03","SM3","SM2-AP/SM3","Single","EEE"]
[null,null,null,"JI XIANG","069711B03","SM2","SM2-RP","Single","EEE"]
[null,null,null,"FANG WANGXI","069712D03","SM2","SM2-RP","Single","ENE"]
[null,null,null,"HUANG YUJUAN","069714H03","SM2","SM2-RP","Single","EEE"]
[null,null,null,"YUDHISTIRA ANDI PRASETYO","069726D03","MOE PreU Scholar (ASEAN)","No bridging","Single","ME"]
[null,null,null,"PENG SHUAI","069730F03","SM3","SM2-AP/SM3","Single","EEE"]
[null,null,null,"VERDYKA KURNIAWAN","069732K03","Sembcorp","No bridging","Single","ME"]
[null,null,null,"ZHANG YUMING","069745H03","SM3","SM2-AP/SM3","Single","EEE"]
[null,null,null,"XU DA","069748C03","SM2","SM2-RP","Single","CEE"]
[null,null,null,"LI YANCHENG","069755L03","SM2","SM2-RP","Single","EEE"]
[null,null,null,"LI YIDUO","069761F03","SM2","SM2-RP","Single","ME"]
[null,null,null,"CHEN YANHONG","069774D03","SM2","SM2-RP","Single","EEE"]
[null,null,null,"ZHANG SONGBAI","069776H03","SM2","SM2-RP","Single","EEE"]
[null,null,null,"SHAILENDRA SAPRA","069778A03","SIA-NOL","No bridging","Single","EEE"]
[null,null,null,"PANG HUANCHANG","069784G03","SM3","SM2-AP/SM3","Single","ME"]
[null,null,null,"SUN ZHE","069791D03","SM2","SM2-RP","Single","EEE"]
[null,null,null,"HONG LEI","069792F03","SM3","SM2-AP/SM3","Single","EEE"]
[null,null,null,"ANKIT DEVENDRAKUMAR GOYAL","069794K03","SIA-NOL","No bridging","Single","EEE"]
[null,null,null,"ARJUN PACHORY","069826H03","SIA-NOL","No bridging","Single","EEE"]
[null,null,null,"ZHAO WEN","069838J18","SM2","SM2-RP","Double (Type 1)","BCG"]
[null,null,null,"ZHONG HUA","069891B18","SM2","SM2-RP","Double (Type 1)","BCG"]
[null,null,null,"ZHAN CAILONG / LELOUCH ZANE","069894H18","SM3","SM2-AP/SM3","Double (Type 1)","BCG"]
[null,null,null,"HOU XUEHUI","069897C18","SM2 (Accelerated)","SM2-AP/SM3","Double (Type 1)","BCG"]
[null,null,null,"HAN LU","069937L20","SM3","SM2-AP/SM3","Single","MAEC"]
[null,null,null,"FENG XUEYING","069941B20","SM2","SM2-RP",{"$f":"VLOOKUP(I$1:I$5281,$A$37:$B$212,2,FALSE)","v":"Single"},"MAEC"]
[null,null,null,"XU SHANSHAN","069942D20","MOE PreU Scholar (PRC)","No bridging","Single","MAEC"]
[null,null,null,"CHEN QIN","069943F20","SM2","SM2-RP","Single","MAEC"]
[null,null,null,"LENG KE","069951E20","SM3","SM2-AP/SM3","Single","MAEC"]
[null,null,null,"LI ZHEN","069956D20","SM3","SM2-AP/SM3","Single","MAEC"]
[null,null,null,"JIANG ZHILIANG","069957F20","MOE PreU Scholar (PRC)","No bridging","Single","MAEC"]
[null,null,null,"YANG NA","069965E20","SM3","SM2-AP/SM3","Single","MAEC"]
[null,null,null,"XIA BINGXING","069967J20","SM2","SM2-RP","Single","MAEC"]
[null,null,null,"HUANG TAO","069970J20","SM3","SM2-AP/SM3","Single","MAEC"]
[null,null,null,"DAI CHENYUAN","069971L20","SM2 (Accelerated)","SM2-AP/SM3","Single","MAEC"]
[null,null,null,"QIAN SIYING","069972B20","MOE PreU Scholar (PRC)","No bridging","Single","MAEC"]
[null,null,null,"WANG TIANTIAN","069973D20","SM2","SM2-RP","Single","MAEC"]
[null,null,null,"LI KUNFEI","069977A20","SM3","SM2-AP/SM3","Single","MAEC"]
[null,null,null,"MAO YISHA","070010F02","SM3","SM2-AP/SM3","Single","CBE"]
[null,null,null,"NATALIE MONICA KARTIKASARI","070030A02","MOE PreU Scholar (ASEAN)","No bridging","Single","CBE"]
[null,null,null,"KONG LINGBIN","070036B02","SM3","SM2-AP/SM3","Single","CBE"]
[null,null,null,"LI LUSI","070058A02","SM2","SM2-RP","Single","CBE"]
[null,null,null,"CHEN ZHULING","070064G02","SM2 (Accelerated)","SM2-AP/SM3","Single","CBE"]
[null,null,null,"KE JIUWU","070065J02","SM3","SM2-AP/SM3","Single","CBE"]
[null,null,null,"HAO LIN","070068D02","SM2 (Accelerated)","SM2-AP/SM3","Single","CBE"]
[null,null,null,"WANG GUANNAN","070079J02","SM2","SM2-RP","Single","CBE"]
[null,null,null,"JIMMY THUROVIN","070083L02","Sembcorp","No bridging","Single","CBE"]
[null,null,null,"CHANG LUSI","070089A02","SM2","SM2-RP","Single","CBE"]
[null,null,null,"ANANTHAKRISHNAN PAVAN ANANTH","070097L02","SIA-NOL","No bridging","Single","CBE"]
[null,null,null,"ZHAO ZIYUAN","070103B02","SM3","SM2-AP/SM3","Single","CBE"]
[null,null,null,"RANGGIE PRATAMA","070105F02","Sembcorp","No bridging","Single","CBE"]
[null,null,null,"LIU CHAORAN","070114G02","SM2","SM2-RP","Single","CBE"]
[null,null,null,"QI HAN","070117B02","MOE PreU Scholar (PRC)","No bridging","Single","CBE"]
[null,null,null,"ZHAO XIN","070121D02","SM3","SM2-AP/SM3","Single","CBE"]
[null,null,null,"ZHAO ZHIYONG","070151B02","SM3","SM2-AP/SM3","Single","CBE"]
[null,null,null,"WANG MENGMENG","070159G02","SM3","SM2-AP/SM3","Single","CBE"]
[null,null,null,"CHEN SI CONG","070175E02","SM2","SM2-RP","Single","CBE"]
[null,null,null,"YANG YAN","070233D02","SM2","SM2-RP","Single","CBE"]
[null,null,null,"RUSLI KARTADINATA","070241C02","Sembcorp","No bridging","Single","CBE"]
[null,null,null,"WANG TAO","070246B02","SM2","SM2-RP","Single","CBE"]
[null,null,null,"QIE XUYANG","070254H07","SM2","SM2-RP","Single","MAT"]
[null,null,null,"ZHAO YAN","070265B07","SM2","SM2-RP","Single","MAT"]
[null,null,null,"SUN KEKE","070276G07","SM2","SM2-RP","Single","MAT"]
[null,null,null,"BAO HAIBO","070284F07","SM3","SM2-AP/SM3","Single","MAT"]
[null,null,null,"FU KUNWU","070299H07","SM3","SM2-AP/SM3","Single","MAT"]
[null,null,null,"ZHANG AO","070305K07","SM2","SM2-RP","Single","MAT"]
[null,null,null,"LING JIN","070326G07","SM2","SM2-RP","Single","MAT"]
[null,null,null,"LU CHANG","070328L07","SM2","SM2-RP","Single","MAT"]
[null,null,null,"GAO SHUANG","070339E07","SM2","SM2-RP","Single","MAT"]
[null,null,null,"WANG FAN","070347D07","SM3","SM2-AP/SM3","Single","MAT"]
[null,null,null,"YU HONG","070355C07","SM3","SM2-AP/SM3","Single","MAT"]
[null,null,null,"CHEN YANG","070359L07","SM3","SM2-AP/SM3","Single","MAT"]
[null,null,null,"GUO XU","070390E07","SM2","SM2-RP","Single","MAT"]
[null,null,null,"YE YUAN","070404A07","SM3","SM2-AP/SM3","Single","MAT"]
[null,null,null,"ZENG XIAOMEI","070405C07","SM3","SM2-AP/SM3","Single","MAT"]
[null,null,null,"HUANG HANYI","070406E07","SM3","SM2-AP/SM3","Single","MAT"]
[null,null,null,"ZHANG YANGDA","070409L07","SM3","SM2-AP/SM3","Single","MAT"]
[null,null,null,"ZHANG ZHONGHAN","070410G07","SM2","SM2-RP","Single","MAT"]
[null,null,null,"ZHOU QIONG","070411J07","SM3","SM2-AP/SM3","Single","MAT"]
[null,null,null,"LING HAN","070419C07","SM3","SM2-AP/SM3","Single","MAT"]
[null,null,null,"XUE BIN","070424G07","SM2","SM2-RP","Single","MAT"]
[null,null,null,"CHEN GAOFENG","070428D07","SM3","SM2-AP/SM3","Single","MAT"]
[null,null,null,"ZHANG BINGJIE","070450H07","SM3","SM2-AP/SM3","Single","MAT"]
[null,null,null,"BIAN SHANGZHI","070452A07","SM2","SM2-RP","Single","MAT"]
[null,null,null,"ZHANG SHIHAO","070465K07","SM3","SM2-AP/SM3","Single","MAT"]
[null,null,null,"ZHOU HAOYU","070768L11","SM2","SM2-RP","Single","BS"]
[null,null,null,"GUO HUIFANG","070783G11","SM3","SM2-AP/SM3","Single","BS"]
[null,null,null,"LU XIAOGUANG","070795C11","SM3","SM2-AP/SM3","Single","BS"]
[null,null,null,"ZHANG AI","070827A11","SM2","SM2-RP","Single","BS"]
[null,null,null,"XIA YAN","070828C11","SM3","SM3",{"$f":"VLOOKUP(I$1:I$5281,$A$37:$B$212,2,FALSE)","v":"Single"},"BS"]
[null,null,null,"CHEN KAINA","070837D11","SM2","SM2-RP","Single","BS"]
[null,null,null,"THERESIA HANDAYANI MINA","070843K11","Sembcorp","No bridging","Single","BS"]
[null,null,null,"HUANG JUNJIE","070859C11","SM2 (Accelerated)","SM2-AP/SM3","Single","BS"]
[null,null,null,"CHEN DAN","070881G11","SM3","SM2-AP/SM3","Single","BS"]
[null,null,null,"ZHOU ZIMIN","070898B11","SM3","SM2-AP/SM3","Single","BS"]
[null,null,null,"PING ZHI","070951B11","SM3","SM2-AP/SM3","Single","BS"]
[null,null,null,"GUAN WENQIAN","071082H14","SM2","SM2-RP","Single","MS"]
[null,null,null,"LI MENGXI","071096H14","SM2","SM2-RP","Single","MS"]
[null,null,null,"XIAO MENG","071110J14","SM2","SM2-RP","Single","MS"]
[null,null,null,"WANG XUJIE","071119E14","SM2","SM2-RP","Single","MS"]
[null,null,null,"GOU XUENI","071143B14","SM3","SM2-AP/SM3","Single","MS"]
[null,null,null,"XIAO MIN","071150K14","SM2","SM2-RP","Single","MS"]
[null,null,null,"KOE HAN BENG","071265B15","Sembcorp","No bridging","Single","AERO"]
[null,null,null,"RUDY RYANTONO SETIAWAN","071351F15","MOE PreU Scholar (ASEAN)","No bridging","Single","AERO"]
[null,null,null,"NG CHRISTINE","071581L19","Sembcorp","No bridging","Single","BIE"]
[null,null,null,"MIAO JIANWEI","071615B19","SM3","SM2-AP/SM3","Single","BIE"]
[null,null,null,"ZHU MENG","071630J19","SM3","SM2-AP/SM3","Single","BIE"]
[null,null,null,"LI YUNSHA","071685A19","SM3","SM2-AP/SM3","Single","BIE"]
[null,null,null,"MIN ZENGYANG","071706H18","SM2 (Accelerated)","SM2-AP/SM3","Double (Type 1)","BCG"]
[null,null,null,"YU BO","071711A18","SM2","SM2-RP","Double (Type 1)","BCG"]
[null,null,null,"QIAN CHENHAO","071713E18","SM3","SM2-AP/SM3","Double (Type 1)","BCG"]
[null,null,null,"LU FEIFEI","071725A18","SM2","SM2-RP","Double (Type 1)","BCG"]
[null,null,null,"BAI LU","071761E18","SM2","SM2-RP","Double (Type 1)","BCG"]
[null,null,null,"ZHANG RUITAO","071766D18","SM3","SM2-AP/SM3","Double (Type 1)","BCG"]
[null,null,null,"LI XUAN","071772K18","SM2","SM2-RP","Double (Type 1)","BCG"]
[null,null,null,"HONG LULU","071774C18","SM2","SM2-RP","Double (Type 1)","BCG"]
[null,null,null,"WANG HAO","071781L18","SM3","SM2-AP/SM3","Double (Type 1)","BCG"]
[null,null,null,"GAN LUHUI","071820F20","SM2 (Accelerated)","SM2-AP/SM3","Single","MAEC"]
[null,null,null,"CHEN FENG","071822K20","SM2","SM2-RP","Single","MAEC"]
[null,null,null,"DAI LIN","071831L20","SM3","SM2-AP/SM3","Single","MAEC"]
[null,null,null,"LIU TIANJING","071833D20","SM2","SM2-RP","Single","MAEC"]
[null,null,null,"LI MENGLING","071844J20","SM3","SM2-AP/SM3","Single","MAEC"]
[null,null,null,"SHAO PENG","071846B20","MOE PreU Scholar (PRC)","No bridging","Single","MAEC"]
[null,null,null,"WANG BINZHU","071847D20","SM2","SM2-RP","Single","MAEC"]
[null,null,null,"WANG YANCHU","071848F20","SM2","SM2-RP","Single","MAEC"]
[null,null,null,"XIAO LONGHUI","071849H20","SM2","SM2-RP","Single","MAEC"]
[null,null,null,"JI LI","071852H20","SM2","SM2-RP","Single","MAEC"]
[null,null,null,"DONG WENZHEN","071853K20","SM3","SM2-AP/SM3","Single","MAEC"]
[null,null,null,"YANG WANYI","071854A20","SM3","SM2-AP/SM3","Single","MAEC"]
[null,null,null,"LI WENJIN","071858J20","SM3","SM2-AP/SM3","Single","MAEC"]
[null,null,null,"DOU LIYU","071867K20","SM3","SM2-AP/SM3","Single","MAEC"]
[null,null,null,"PAN GAOWA","071875J20","SM3","SM2-AP/SM3","Single","MAEC"]
[null,null,null,"ZHANG YAPING","071876L20","SM3","SM2-AP/SM3","Single","MAEC"]
[null,null,null,"XIE TAOJUN","071882F20","MOE PreU Scholar (PRC)","No bridging","Single","MAEC"]
[null,null,null,"LI LI","071883H20","MOE PreU Scholar (PRC)","No bridging","Single","MAEC"]
[null,null,null,"LI JUNHUA","071886C20","SM2","SM2-RP","Single","MAEC"]
[null,null,null,"XIA CHONGWU","071887E20","SM3","SM2-AP/SM3","Single","MAEC"]
[null,null,null,"ZHA YUN","071984C20","SM2","SM2-RP","Single","MAEC"]
[null,null,null,"ELVY RIANI WANJAYA","073089H16","Sembcorp","No bridging","Single","CHEM"]
[null,null,null,"ZENG XIN","073097G16","SM3","SM2-AP/SM3","Single","CHEM"]
[null,null,null,"YU NAISHAN","073103J16","SM2","SM2-RP","Single","MATH"]
[null,null,null,"CHAI HUA","073138F16","SM2","SM2-RP","Single","CHEM"]
[null,null,null,"YUAN ZHEN","073159C16","SM3","SM2-AP/SM3","Single","CHEM"]
[null,null,null,"XIAO YUNYUN","073179J16","SM2","SM2-RP","Single","CHEM"]
[null,null,null,"ZHANG QI","073199D16","SM3","SM2-AP/SM3","Single","CHEM"]
[null,null,null,"ZHANG LIHONG","073208A16","SM2","SM2-RP","Single","CHEM"]
[null,null,null,"HUANG SIJIA","073231G16","SM2","SM2-RP","Single","CHEM"]
[null,null,null,"MERALDO ANTONIO","073274C16","Sembcorp","No bridging","Single","CHEM"]
[null,null,null,"TONG ZHESEN","073357G16","SM2","SM2-RP","Single","MATH"]
[null,null,null,"MRIDULA DAMODARAN","073363B16","SIA-NOL","No bridging","Single","PHY"]
[null,null,null,"TONG QINJIE","073400D16","SM3","SM2-AP/SM3","Single","CHEM"]
[null,null,null,"LI CHUNMING","073403K16","SM2","SM2-RP","Single","MATH"]
[null,null,null,"FERRY KURNIAWAN","073406E16","Sembcorp","No bridging","Single","CHEM"]
[null,null,null,"LV YUNBO","073430B16","SM3","SM2-AP/SM3",{"$f":"VLOOKUP(I$1:I$5281,$A$37:$B$212,2,FALSE)","v":"Single"},"CHEM"]
[null,null,null,"LIU MEI","073436C16","SM3","SM2-AP/SM3","Single","MATH"]
[null,null,null,"YAO QIANG","073470C16","SM3","SM2-AP/SM3","Single","MATH"]
[null,null,null,"ZHANG ZHIFENG","073541L16","SM3","SM2-AP/SM3","Single","PHY"]
[null,null,null,"TEUKU MAHFUZH AUFAR KARI","073544F16","Sembcorp","No bridging","Single","CHEM"]
[null,null,null,"YANG LU","073557D16","SM2","SM2-RP","Single","MATH"]
[null,null,null,"LIU PENG","073559H16","SM3","SM2-AP/SM3","Single","PHY"]
[null,null,null,"RIANDY TANRI","073572L16","Sembcorp","No bridging","Single","CHEM"]
[null,null,null,"LIAO YUSEN","073684L16","SM3","SM2-AP/SM3","Single","CHEM"]
[null,null,null,"LIANG LITING","074912G06","SM3","SM2-AP/SM3","Single","CE"]
[null,null,null,"NAN LONG","074923A06","SM3","SM2-AP/SM3","Single","CSC"]
[null,null,null,"GUO YANG","074945L06","SM3","SM2-AP/SM3","Single","CE"]
[null,null,null,"LIU YUAN","074947D06","SM2","SM2-RP","Single","CE"]
[null,null,null,"NIKITA KUMAR","074952H06","SIA-NOL","No bridging","Single","CSC"]
[null,null,null,"GAN LU","074965F06","SM2","SM2-RP","Single","CE"]
[null,null,null,"WEI RUONAN","074972C06","SM3","SM2-AP/SM3","Single","CE"]
[null,null,null,"WANG YUXUAN","074986C06","SM2","SM2-RP","Single","CE"]
[null,null,null,"ABHISHEK DAS","074987E06","SIA-NOL","No bridging","Single","CSC"]
[null,null,null,"YAO CHANG","074992J06","SM3","SM2-AP/SM3","Single","CE"]
[null,null,null,"ZHAO YU","074993L06","SM3","SM2-AP/SM3","Single","CE"]
[null,null,null,"HARI HARAN CHANDRASEKARAN","075019C06","SIA-NOL","No bridging","Single","CSC"]
[null,null,null,"NIU YIMING","075036C06","SM3","SM2-AP/SM3","Single","CE"]
[null,null,null,"LU ZHILONG","075047H06","SM2","SM2-RP","Single","CE"]
[null,null,null,"NIU XUDONG","075053C06","SM3","SM2-AP/SM3","Single","CE"]
[null,null,null,"ANINDITA PAL","075056J06","SIA-NOL","No bridging","Single","CE"]
[null,null,null,"WANG YE","075058B06","SM3","SM2-AP/SM3","Single","CE"]
[null,null,null,"ZOU MENGFAN","075074L06","SM2","SM2-RP","Single","CE"]
[null,null,null,"TAN HUICHENG","075097A06","SM3","SM2-AP/SM3","Single","CSC"]
[null,null,null,"HE JIANXIN","075103C06","SM3","SM2-AP/SM3","Single","CE"]
[null,null,null,"XU ZHENYU","075123J06","SM3","SM2-AP/SM3","Single","CE"]
[null,null,null,"LIU YUANCHENG","075135E06","SM3","SM2-AP/SM3","Single","CE"]
[null,null,null,"LI YUFENG","075136G06","SM3","SM2-AP/SM3","Single","CE"]
[null,null,null,"YANG YANG","075153G06","SM3","SM2-AP/SM3","Single","CE"]
[null,null,null,"PRIYABRATA PRIYADARSHI","075165C06","SIA-NOL","No bridging","Single","CE"]
[null,null,null,"JAYESH KANNAN","075178A06","SIA-NOL","No bridging","Single","CE"]
[null,null,null,"SHIVA GARG","075185J06","SIA-NOL","No bridging","Single","CSC"]
[null,null,null,"GUO RUILIANG","075206B06","SM3","SM2-AP/SM3","Single","CE"]
[null,null,null,"LIN RUNHUI","075211F06","SM3","SM2-AP/SM3","Single","CE"]
[null,null,null,"XU YADONG","075229C06","SM3","SM2-AP/SM3","Single","CE"]
[null,null,null,"QU XIN","075232C06","SM3","SM2-AP/SM3","Single","CE"]
[null,null,null,"ZENG WEI","075236L06","SM3","SM2-AP/SM3","Single","CE"]
[null,null,null,"WANG XU","075238D06","MOE PreU Scholar (PRC)","No bridging","Single","CSC"]
[null,null,null,"WANG YIYUAN","075239F06","SM3","SM2-AP/SM3","Single","CSC"]
[null,null,null,"YU JIANMIN","075242F06","SM2","SM2-RP","Single","CE"]
[null,null,null,"SUN FEI","075251G06","SM2","SM2-RP","Single","CE"]
[null,null,null,"WANG YINGQI","075273F06","SM3","SM2-AP/SM3","Single","CE"]
[null,null,null,"ZHANG ZONGLU","075284L06","SM3","SM2-AP/SM3","Single","CE"]
[null,null,null,"NI PENG","075291H06","SM3","SM2-AP/SM3","Single","CE"]
[null,null,null,"YANG YANG","075294C06","SM3","SM2-AP/SM3","Single","CE"]
[null,null,null,"RITESH KALRA","075303L06","SIA-NOL","No bridging","Single","CSC"]
[null,null,null,"LIU XIN","075304B06","SM3","SM2-AP/SM3","Single","CSC"]
[null,null,null,"ROHIT ASHWINI KUMAR","075309A06","SIA-NOL","No bridging","Single","CE"]
[null,null,null,"YANG SHANSHAN","075323F06","SM2","SM2-RP","Single","CSC"]
[null,null,null,"XING YUTENG","075338H06","SM3","SM2-AP/SM3","Single","CE"]
[null,null,null,"JIANG ZHIHUI","075351L06","SM3","SM2-AP/SM3","Single","CE"]
[null,null,null,"ZHANG GUOLONG","077106K03","SM3","SM2-AP/SM3","Single","EEE"]
[null,null,null,"CHIRANJIV SAWHNEY","077133B03","SIA-NOL","No bridging","Single","EEE"]
[null,null,null,"LI LEICHEN","077136H03","SM3","SM2-AP/SM3","Single","CEE"]
[null,null,null,"LI BINGXUAN","077161G03","SM3","SM2-AP/SM3","Single","EEE"]
[null,null,null,"WU SHULI","077163L03","SM3","SM2-AP/SM3","Single","ME"]
[null,null,null,"ROHAN VERMA","077173C03","SIA-NOL","No bridging","Single","EEE"]
[null,null,null,"WANG SHUSEN","077182D03","SM2","SM2-RP","Single","EEE"]
[null,null,null,"ZHAO YUELONG","077190C03","SM3","SM2-AP/SM3","Single","EEE"]
[null,null,null,"YOU RAN","077194L03","SM2","SM2-RP","Single","IEM"]
[null,null,null,"ZHOU SHUAI","077196D03","SM3","SM2-AP/SM3",{"$f":"VLOOKUP(I$1:I$5281,$A$37:$B$212,2,FALSE)","v":"Single"},"CEE"]
[null,null,null,"ZHANG HAOZE","077224E03","SM3","SM2-AP/SM3","Single","IEM"]
[null,null,null,"DANG KANG","077236A03","SM2","SM2-RP","Single","EEE"]
[null,null,null,"FAN TONGLIN","077250F03","SM3","SM2-AP/SM3","Single","EEE"]
[null,null,null,"CHEN ZHENGFEI","077255E03","SM2","SM2-RP","Single","EEE"]
[null,null,null,"LIU XIAOLIANG","077256G03","SM3","SM2-AP/SM3","Single","EEE"]
[null,null,null,"YING RENJIE","077262B03","SM3","SM2-AP/SM3","Single","EEE"]
[null,null,null,"CAO MENGYUE","077279H03","SM2","SM2-RP","Single","EEE"]
[null,null,null,"CHENG CHI","077281F03","SM2","SM2-RP","Single","EEE"]
[null,null,null,"ZHANG CHAO","077298A03","SM3","SM2-AP/SM3","Single","EEE"]
[null,null,null,"CHEN HONGMEI","077308L03","SM2","SM2-RP","Single","EEE"]
[null,null,null,"CHU XIAOWEI","077326B03","SM2 (Accelerated)","SM2-AP/SM3","Single","EEE"]
[null,null,null,"RU SHANSHAN","077332H03","SM3","SM2-AP/SM3","Single","EEE"]
[null,null,null,"GU YI","077342L03","SM3","SM2-AP/SM3","Single","EEE"]
[null,null,null,"HONG CHANGLONG","077343B03","SM2","SM2-RP","Single","EEE"]
[null,null,null,"CHEN HUANLONG","077353E03","SM3","SM2-AP/SM3","Single","EEE"]
[null,null,null,"LIU SHUANG","077365A03","SM2","SM2-RP","Single","IEM"]
[null,null,null,"ZENG YUNJIA","077372J03","SM2","SM2-RP","Single","EEE"]
[null,null,null,"TANG HAO","077377H03","SM3","SM2-AP/SM3","Single","EEE"]
[null,null,null,"DING YAN","077387L03","SM2","SM2-RP","Single","ME"]
[null,null,null,"AN DELIE","077389D03","SM2","SM2-RP","Single","EEE"]
[null,null,null,"LI BO","077414K03","SM2","SM2-RP","Single","EEE"]
[null,null,null,"ZHAO SHIYU","077415A03","SM3","SM2-AP/SM3","Single","ME"]
[null,null,null,"HU MENG","077417E03","SM2","SM2-RP","Single","ME"]
[null,null,null,"WANG YANNAN","077419J03","SM2","SM2-RP","Single","EEE"]
[null,null,null,"CHEN QING","077433C03","SM2","SM2-RP","Single","EEE"]
[null,null,null,"CUI TINGTING","077459K03","SM3","SM2-AP/SM3","Single","EEE"]
[null,null,null,"ZHANG ZHENGCHANG","077491F03","SM2","SM2-RP","Single","EEE"]
[null,null,null,"CHEN XINYI","077497G03","SM2","SM2-RP","Single","EEE"]
[null,null,null,"WANG PEIKAI","077503J03","SM3","SM2-AP/SM3","Single","EEE"]
[null,null,null,"DU XINXIN","077510F03","SM3","SM2-AP/SM3","Single","ME"]
[null,null,null,"ZHANG DONGYE","077513A03","SM3","SM2-AP/SM3","Single","EEE"]
[null,null,null,"XU SHITONG","077523D03","SM3","SM2-AP/SM3","Single","CEE"]
[null,null,null,"XIAO XIAO","077537D03","SM2","SM2-RP","Single","EEE"]
[null,null,null,"LV XING","077549L03","SM2","SM2-RP","Single","ME"]
[null,null,null,"LIU HANG","077552L03","SM2 (Accelerated)","SM2-AP/SM3","Single","EEE"]
[null,null,null,"JIANG NIAN","077588K03","SM2","SM2-RP","Single","EEE"]
[null,null,null,"ARUN SHANKAR","077600G03","SIA-NOL","No bridging","Single","EEE"]
[null,null,null,"LI NING","077620B03","SM2","SM2-RP","Single","ME"]
[null,null,null,"LI FUBAI","077623H03","SM2","SM2-RP","Single","ME"]
[null,null,null,"HAN XIAOHAN","077642A03","SM2","SM2-RP","Single","CEE"]
[null,null,null,"XIAO JIANFANG","077643C03","SM3","SM2-AP/SM3","Single","ME"]
[null,null,null,"ZHAO HAINAN","077644E03","SM3","SM2-AP/SM3","Single","EEE"]
[null,null,null,"LIN SONG","077654H03","SM3","SM2-AP/SM3","Single","ME"]
[null,null,null,"RUDY SUSANTO","077680J03","Sembcorp","No bridging","Single","ME"]
[null,null,null,"WANG PENG","077696B03","SM3","SM2-AP/SM3","Single","EEE"]
[null,null,null,"TAO SUI","077707C03","SM3","SM2-AP/SM3","Single","EEE"]
[null,null,null,"LI XINRAN","077710C03","SM3","SM2-AP/SM3","Single","EEE"]
[null,null,null,"SHEN WANYING","077725E03","SM2","SM2-RP","Single","EEE"]
[null,null,null,"LIU FEI","077812L03","SM2","SM2-RP","Single","EEE"]
[null,null,null,"WEN KAI","077833H03","SM2","SM2-RP","Single","EEE"]
[null,null,null,"LI YUEJUN","077838G03","SM3","SM2-AP/SM3","Single","EEE"]
[null,null,null,"TAO YUE","077839J03","SM2","SM2-RP","Single","EEE"]
[null,null,null,"LI QINGHUA","077871E03","SM3","SM2-AP/SM3","Single","ENE"]
[null,null,null,"IVAN STEVEN JAYAWAN","077876D03","Sembcorp","No bridging","Single","ENE"]
[null,null,null,"GUAN LUFAN","077881H03","SM3","SM2-AP/SM3","Single","IEM"]
[null,null,null,"REINALDO WIJAYA","077886G03","Sembcorp","No bridging","Single","EEE"]
[null,null,null,"REN RUI","077888L03","SM3","SM2-AP/SM3","Single","EEE"]
[null,null,null,"ZHANG JING","077890J03","SM3","SM2-AP/SM3","Single","EEE"]
[null,null,null,"LI TUN","077891L03","SM2","SM2-RP","Single","CEE"]
[null,null,null,"CHANG HONG","077897A03","SM2","SM2-RP","Single","EEE"]
[null,null,null,"HAN FEIMIN","077903C03","SM3","SM2-AP/SM3","Single","IEM"]
[null,null,null,"ZHANG PENG","077910L03","SM2","SM2-RP","Single","EEE"]
[null,null,null,"ZHAO JIAN","077929K03","SM3","SM2-AP/SM3","Single","EEE"]
[null,null,null,"LIU FANGYING","077949E03","SM2","SM2-RP",{"$f":"VLOOKUP(I$1:I$5281,$A$37:$B$212,2,FALSE)","v":"Single"},"EEE"]
[null,null,null,"QIU SHIYANG","077971J03","SM3","SM2-AP/SM3","Single","ME"]
[null,null,null,"ZHAO JING","077989F03","SM2","SM2-RP","Single","EEE"]
[null,null,null,"LI JIANWEI","078003G03","SM3","SM2-AP/SM3","Single","EEE"]
[null,null,null,"HUANG FEI","078014A03","SM3","SM2-AP/SM3","Single","EEE"]
[null,null,null,"WANG YUXI","078025F03","SM3","SM2-AP/SM3","Single","EEE"]
[null,null,null,"SUN XUEQIAO","078034G03","SM3","SM2-AP/SM3","Single","EEE"]
[null,null,null,"LI ZHI","078038D03","SM3","SM2-AP/SM3","Single","ME"]
[null,null,null,"VRINDA MADAN","078065G03","SIA-NOL","No bridging","Single","EEE"]
[null,null,null,"ZHANG TAISHI","078084L03","SM3","SM2-AP/SM3","Single","EEE"]
[null,null,null,"FEBRINA ARYANI","078095E03","Sembcorp","No bridging","Single","CEE"]
[null,null,null,"XU DANNI","078112A03","SM3","SM2-AP/SM3","Single","ENE"]
[null,null,null,"ZHANG BOYU","078134L03","SM2","SM2-RP","Single","EEE"]
[null,null,null,"YANG YIXING","078155H03","SM3","SM2-AP/SM3","Single","EEE"]
[null,null,null,"PI KE","078157A03","SM3","SM2-AP/SM3","Single","EEE"]
[null,null,null,"RISHABH GURUNATH TALWALKAR","078176E03","SIA Youth","No bridging","Single","ME"]
[null,null,null,"WANG XUAN","078183B03","SM2","SM2-RP","Single","EEE"]
[null,null,null,"TAN XIAOLIANG","078199F03","SM3","SM2-AP/SM3","Single","EEE"]
[null,null,null,"LIU XUKUN","078202B03","SM3","SM2-AP/SM3","Single","IEM"]
[null,null,null,"SANKET GUPTA","078214J03","SIA-NOL","No bridging","Single","EEE"]
[null,null,null,"TANG JIAQI","078222H03","SM2","SM2-RP","Single","EEE"]
[null,null,null,"LI BINGBING","078228J03","SM3","SM2-AP/SM3","Single","ME"]
[null,null,null,"MONICA JOCELYNNE HANDAYANI","078249F03","Sembcorp","No bridging","Single","EEE"]
[null,null,null,"ROHIT JHA","078252F03","SIA-NOL","No bridging","Single","EEE"]
[null,null,null,"XU DI","078268K03","SM3","SM2-AP/SM3","Single","EEE"]
[null,null,null,"WAN PENG","078272A03","SM3","SM2-AP/SM3","Single","EEE"]
[null,null,null,"LIN LIYONG","078300B03","SM3","SM2-AP/SM3","Single","EEE"]
[null,null,null,"LI LUFEI","078322A03","SM2 (Accelerated)","SM2-AP/SM3","Single","EEE"]
[null,null,null,"DARWIN KUSUMA","078345B03","Sembcorp","No bridging","Single","ME"]
[null,null,null,"ZHENG XIA","078347F03","SM2","SM2-RP","Single","EEE"]
[null,null,null,"QIAN YUE","078373G03","SM2","SM2-RP","Single","EEE"]
[null,null,null,"LIU JIAN","078380D03","SM2","SM2-RP","Single","EEE"]
[null,null,null,"WU HAN","078409B03","SM2","SM2-RP","Single","IEM"]
[null,null,null,"ZHANG SHILONG","078414F03","SM3","SM2-AP/SM3","Single","EEE"]
[null,null,null,"YU XUE","078419E03","SM3","SM2-AP/SM3","Single","ME"]
[null,null,null,"KRISNADI WICAKSONO","078426B03","Sembcorp","No bridging","Single","EEE"]
[null,null,null,"MENG FANYI","078427D03","SM2","SM2-RP","Single","EEE"]
[null,null,null,"SHI ZHAO","078432H03","SM3","SM2-AP/SM3","Single","EEE"]
[null,null,null,"LUO TIANLIN","078434A03","SM2","SM2-RP","Single","EEE"]
[null,null,null,"GUO XIAOXIN","078435C03","SM3","SM2-AP/SM3","Single","EEE"]
[null,null,null,"ZHANG YING","078438J03","SM3","SM2-AP/SM3","Single","EEE"]
[null,null,null,"LI XIAOHONG","078439L03","SM2 (Accelerated)","SM2-AP/SM3","Single","EEE"]
[null,null,null,"LIU SHUO","078459F03","SM2 (Accelerated)","SM2-AP/SM3","Single","ME"]
[null,null,null,"WU XIA","078475D03","SM3","SM2-AP/SM3","Single","ME"]
[null,null,null,"DAI MIAO","078485G03","SM2","SM2-RP","Single","IEM"]
[null,null,null,"WU DI","078505J03","SM2","SM2-RP","Single","EEE"]
[null,null,null,"HU ZONGJIANG","078507B03","SM3","SM2-AP/SM3","Single","EEE"]
[null,null,null,"DI ZHENGYE","078512F03","SM2","SM2-RP","Single","EEE"]
[null,null,null,"LIN YIDING","078527H03","SM3","SM2-AP/SM3","Single","EEE"]
[null,null,null,"SUDHANSHU AHUJA","078541B03","SIA-NOL","No bridging","Single","EEE"]
[null,null,null,"DIPAK IYER","078542D03","SIA Youth","No bridging","Single","ME"]
[null,null,null,"FU JINWEI","078546A03","SM2","SM2-RP","Single","EEE"]
[null,null,null,"LAN SONG","078568L03","SM3","SM2-AP/SM3","Single","EEE"]
[null,null,null,"HUANG YI","078569B03","SM2","SM2-RP","Single","EEE"]
[null,null,null,"HUANG YUNLONG","078576K03","SM2 (Accelerated)","SM2-AP/SM3","Single","EEE"]
[null,null,null,"ZHANG WEIJUN","078606D03","SM2","SM2-RP","Single","EEE"]
[null,null,null,"PAN JIAN","078621L03","SM3","SM2-AP/SM3","Single","EEE"]
[null,null,null,"YAO FEI","078622B03","SM2","SM2-RP","Single","EEE"]
[null,null,null,"QIU YIHUI","078641F03","SM2","SM2-RP","Single","IEM"]
[null,null,null,"YU KANGRAN","078651J03","SM2","SM2-RP","Single","IEM"]
[null,null,null,"ZHANG YITING","078654D03","SM2","SM2-RP","Single","EEE"]
[null,null,null,"WANG ZHE","078655F03","SM3","SM2-AP/SM3","Single","EEE"]
[null,null,null,"ZHANG LINXIAO","078673H03","SM2","SM2-RP","Single","EEE"]
[null,null,null,"BIAN ZHIWEI","078678G03","SM3","SM2-AP/SM3","Single","EEE"]
[null,null,null,"LUO JIANYU","078680E03","SM2","SM2-RP",{"$f":"VLOOKUP(I$1:I$5281,$A$37:$B$212,2,FALSE)","v":"Single"},"ME"]
[null,null,null,"MI QI","078696J03","SM2","SM2-RP","Single","IEM"]
[null,null,null,"LUO MINGXU","078706H03","SM3","SM2-AP/SM3","Single","IEM"]
[null,null,null,"CHENG YOU","078718D03","SM3","SM2-AP/SM3","Single","EEE"]
[null,null,null,"YE CHENGLIANG","078736F03","SM3","SM2-AP/SM3","Single","ME"]
[null,null,null,"XUAN YAN","078743C03","SM2","SM2-RP","Single","EEE"]
[null,null,null,"WANG MENGYING","078746J03","SM2","SM2-RP","Single","IEM"]
[null,null,null,"KURNIAWAN PRASETYA PIETH","078772K03","Sembcorp","No bridging","Single","CEE"]
[null,null,null,"WANG YU","078786K03","SM3","SM2-AP/SM3","Single","EEE"]
[null,null,null,"SUN MOUXUAN","078792E03","SM3","SM2-AP/SM3","Single","EEE"]
[null,null,null,"MA LIN","078828L03","SM2","SM2-RP","Single","ENE"]
[null,null,null,"HARYONO","078846B03","Sembcorp","No bridging","Single","ME"]
[null,null,null,"SHAO BINGCHU","078848F03","SM2","SM2-RP","Single","EEE"]
[null,null,null,"QI MIN","078849H03","SM3","SM2-AP/SM3","Single","ENE"]
[null,null,null,"NATHAN LINARTO","078863B03","Sembcorp","No bridging","Single","EEE"]
[null,null,null,"LIU QING","078874G03","SM3","SM2-AP/SM3","Single","EEE"]
[null,null,null,"XU WENYING","078884K03","SM2","SM2-RP","Single","EEE"]
[null,null,null,"DING CHAO","078897H03","SM3","SM2-AP/SM3","Single","ME"]
[null,null,null,"LI TAO","078908J03","SM3","SM2-AP/SM3","Single","EEE"]
[null,null,null,"MENG HUAIYU","078910G03","SM2 (Accelerated)","SM2-AP/SM3","Single","EEE"]
[null,null,null,"LIN LIN","078940E03","SM2","SM2-RP","Single","EEE"]
[null,null,null,"SHI WENYANG","078942J03","SM2 (Accelerated)","SM2-AP/SM3","Single","ENE"]
[null,null,null,"LU DONGJUN","078954E03","SM3","SM2-AP/SM3","Single","ME"]
[null,null,null,"MIHIR PANT","078961B03","SIA-NOL","No bridging","Single","EEE"]
[null,null,null,"ZHANG CHEN","078979K03","SM3","SM2-AP/SM3","Single","EEE"]
[null,null,null,"LI ROUGANG","078993D03","SM2","SM2-RP","Single","CEE"]
[null,null,null,"ZHANG YANG","079004E03","SM2","SM2-RP","Single","IEM"]
[null,null,null,"LARAS PROBO SUYOTO","079006J03","Sembcorp","No bridging","Single","EEE"]
[null,null,null,"LIU BING","079011B03","SM3","SM2-AP/SM3","Single","EEE"]
[null,null,null,"WANG BEI","079016A03","SM3","SM2-AP/SM3","Single","IEM"]
[null,null,null,"LI JINLI","079027F03","SM3","SM2-AP/SM3","Single","EEE"]
[null,null,null,"SHI ZHIYUAN","079035E03","SM3","SM2-AP/SM3","Single","ME"]
[null,null,null,"ZHU SHENG","079043D03","SM2","SM2-RP","Single","EEE"]
[null,null,null,"ZHOU HONGTAO","079049E03","SM2 (Accelerated)","SM2-AP/SM3","Single","EEE"]
[null,null,null,"SHENG YUNZHOU","079055L03","SM2","SM2-RP","Single","EEE"]
[null,null,null,"ZHANG SHUYAN","079062H03","SM2","SM2-RP","Single","EEE"]
[null,null,null,"ZHANG CHAO","079071J03","SM2 (Accelerated)","SM2-AP/SM3","Single","ME"]
[null,null,null,"HU XUDONG","079078A03","SM2","SM2-RP","Single","EEE"]
[null,null,null,"LIU XIAOHUI","079081A03","SM3","SM2-AP/SM3","Single","EEE"]
[null,null,null,"ZHANG LI","079109B20","SM3","SM2-AP/SM3","Single","MATH"]
[null,null,null,"SUN GE","079114F20","SM2 (Accelerated)","SM2-AP/SM3","Single","MAEC"]
[null,null,null,"WU YUAN","079116K20","SM2","SM2-RP","Single","MAEC"]
[null,null,null,"YANG LU","079120A20","SM2","SM2-RP","Single","MAEC"]
[null,null,null,"LI YUTING","079129H20","SM2","SM2-RP","Single","MAEC"]
[null,null,null,"HU YU","079221E02","SM2","SM2-RP","Single","CBE"]
[null,null,null,"WANG QING","081714L15","SM2","SM2-RP","Single","AERO"]
[null,null,null,"WANG HAO","081736K15","SM2","SM2-RP","Single","AERO"]
[null,null,null,"ARPITA SINHA","081754A15","SIA Youth","No bridging","Single","AERO"]
[null,null,null,"DU JIAXING","081791G15","SM3","SM2-AP/SM3","Single","AERO"]
[null,null,null,"FANG YU","081891K19","SM2","SM2-RP","Single","BIE"]
[null,null,null,"IRWANDI SUSANTO","081917B19","Sembcorp","No bridging","Single","CBE"]
[null,null,null,"CAO ZHUOQUN","083035E02","SM2","SM2-RP","Single","CBE"]
[null,null,null,"XU RUI","083065C02","SM3","SM2-AP/SM3","Single","CBE"]
[null,null,null,"GUAN SHANSHAN","083072L02","SM2","SM2-RP","Single","CBE"]
[null,null,null,"XIA XIAOYANG","083098G02","SM3","SM2-AP/SM3","Single","CBE"]
[null,null,null,"PU LU","083110D02","SM3","SM2-AP/SM3","Single","CBE"]
[null,null,null,"LIU ANDONG","083132C02","SM3","SM2-AP/SM3","Single","CBE"]
[null,null,null,"NIU SHENGLAN","083152J02","SM2","SM2-RP","Single","CBE"]
[null,null,null,"GUO ERFEI","083154B02","SM3","SM2-AP/SM3","Single","CBE"]
[null,null,null,"SHAO XINGCHI","083155D02","SM2 (Accelerated)","SM2-AP/SM3","Single","CBE"]
[null,null,null,"IVERT TANIWANGSA","083159A02","Sembcorp","No bridging","Single","CBE"]
[null,null,null,"XU JIECHENG","083210H02","SM2","SM2-RP","Single","CBE"]
[null,null,null,"LU MINGMIN","083215G02","SM3","SM2-AP/SM3","Single","CBE"]
[null,null,null,"XIANG DAO","083223F02","SM2","SM2-RP","Single","CBE"]
[null,null,null,"WU SHUYING","083234L02","SM2","SM2-RP",{"$f":"VLOOKUP(I$1:I$5281,$A$37:$B$212,2,FALSE)","v":"Single"},"CBE"]
[null,null,null,"LIU TONG","083238H02","SM3","SM2-AP/SM3","Single","CBE"]
[null,null,null,"MEGHA GIRISH MANSHARAMANI","083247J02","SIA Youth","No bridging","Single","CBE"]
[null,null,null,"GAO YATING","083250J02","SM2","SM2-RP","Single","CBE"]
[null,null,null,"HE MEI","083276E02","SM3","SM2-AP/SM3","Single","CBE"]
[null,null,null,"WANG YAJIE","083280G02","SM3","SM2-AP/SM3","Single","CBE"]
[null,null,null,"SHAN YIYUN","083290K02","SM2","SM2-RP","Single","CBE"]
[null,null,null,"LI YANG","083318C03","SM2","SM2-RP","Single","EEE"]
[null,null,null,"NIU ZEPING","083322E03","SM3","SM2-AP/SM3","Single","EEE"]
[null,null,null,"LIU FENGJIAO","083335C03","SM3","SM2-AP/SM3","Single","EEE"]
[null,null,null,"QIU XUEHENG","083339L03","SM3","SM2-AP/SM3","Single","EEE"]
[null,null,null,"ZHONG CHUNPENG","083353E03","SM3","SM2-AP/SM3","Single","EEE"]
[null,null,null,"YANG YUANRUI","083395K03","SM3","SM2-AP/SM3","Single","ME"]
[null,null,null,"WANG ZHE","083405J03","SM3","SM2-AP/SM3","Single","EEE"]
[null,null,null,"ZHANG FAN","083412F03","SM2","SM2-RP","Single","EEE"]
[null,null,null,"ZHANG ZIXUAN","083426F03","SM3","SM2-AP/SM3","Single","EEE"]
[null,null,null,"WU JIAN","083459K03","SM3","SM2-AP/SM3","Single","ME"]
[null,null,null,"TIAN YIFENG","083466G03","SM3","SM2-AP/SM3","Single","EEE"]
[null,null,null,"ZHAO JIARUI","083470J03","SM3","SM2-AP/SM3","Single","EEE"]
[null,null,null,"PAN YUNRU","083471L03","SM2","SM2-RP","Single","EEE"]
[null,null,null,"LIU YANAN","083475H03","SM3","SM2-AP/SM3","Single","EEE"]
[null,null,null,"ZHANG QINGQING","083477A03","SM3","SM2-AP/SM3","Single","ME"]
[null,null,null,"ANDREW JULIUS TIONARDY","083490D03","Sembcorp","No bridging","Single","ENE"]
[null,null,null,"ZHU ZHEN","083496E03","SM2","SM2-RP","Single","ENE"]
[null,null,null,"ZHANG YONGSONG","083503J03","SM3","SM2-AP/SM3","Single","EEE"]
[null,null,null,"DINKAR MOHTA","083514C03","SIA-NOL","No bridging","Single","EEE"]
[null,null,null,"XUE JIN","083520J03","SM2","SM2-RP","Single","EEE"]
[null,null,null,"YANG BO","083523D03","SM2","SM2-RP","Single","EEE"]
[null,null,null,"LIU XIN","083538F03","SM3","SM2-AP/SM3","Single","EEE"]
[null,null,null,"LIANG CHEN","083545C03","SM3","SM2-AP/SM3","Single","EEE"]
[null,null,null,"WANG BIN","083570B03","SM3","SM2-AP/SM3","Single","EEE"]
[null,null,null,"LIU XUEZHE","083575A03","SM2","SM2-RP","Single","EEE"]
[null,null,null,"ZHANG YUJIE","083580E03","SM3","SM2-AP/SM3","Single","ME"]
[null,null,null,"LIU HAOCHEN","083582J03","SM3","SM2-AP/SM3","Single","EEE"]
[null,null,null,"ZHU WU","083593C03","SM3","SM2-AP/SM3","Single","EEE"]
[null,null,null,"ZHANG FAN","083609C03","SM2","SM2-RP","Single","EEE"]
[null,null,null,"LI ZEYU","083636F03","SM2","SM2-RP","Single","EEE"]
[null,null,null,"XU SHIYAN","083638K03","SM2","SM2-RP","Single","EEE"]
[null,null,null,"WANG PEIWEN","083639A03","SM2","SM2-RP","Single","EEE"]
[null,null,null,"HUANG XU","083654H03","SM2","SM2-RP","Single","ME"]
[null,null,null,"WANG YUPU","083670F03","SM2","SM2-RP","Single","EEE"]
[null,null,null,"WAN YI","083672K03","SM2","SM2-RP","Single","ME"]
[null,null,null,"ZHOU QIAO","083700L03","SM2","SM2-RP","Single","EEE"]
[null,null,null,"ZHENG KUANGDI","083725E03","SM2","SM2-RP","Single","EEE"]
[null,null,null,"XU YANXIA","083726G03","SM3","SM2-AP/SM3","Single","EEE"]
[null,null,null,"MATHANGI SRINIVASAN","083734F03","SIA-NOL","No bridging","Single","EEE"]
[null,null,null,"YE CHUANG","083747D03","SM2","SM2-RP","Single","EEE"]
[null,null,null,"LI NANXI","083758J03","SM2","SM2-RP","Single","EEE"]
[null,null,null,"YAN HONGYI","083762L03","SM3","SM2-AP/SM3","Single","EEE"]
[null,null,null,"ZHAO YANG","083774G03","SM2","SM2-RP","Single","EEE"]
[null,null,null,"CHEN LAN","083834K03","SM3","SM2-AP/SM3","Single","EEE"]
[null,null,null,"OLIVIA ONG","083850H03","Sembcorp","No bridging","Single","EEE"]
[null,null,null,"YANG YIKUAN","083862D03","SM3","SM2-AP/SM3","Single","ME"]
[null,null,null,"ZHANG YUXI","083907L03","SM2","SM2-RP","Single","EEE"]
[null,null,null,"XU JUN","083926D03","SM3","SM2-AP/SM3","Single","CEE"]
[null,null,null,"LIU MI","083970G03","SM2","SM2-RP","Single","EEE"]
[null,null,null,"ZHANG RUOSHI","083980K03","SM3","SM2-AP/SM3","Single","EEE"]
[null,null,null,"HAN AIGUO","083982C03","SM3","SM2-AP/SM3","Single","EEE"]
[null,null,null,"FU CHAO","083988D03","SM3","SM2-AP/SM3","Single","ME"]
[null,null,null,"WANG JIAO","083992F03","SM2","SM2-RP","Single","EEE"]
[null,null,null,"NI SUTENG","084009H03","SM2","SM2-RP","Single","CEE"]
[null,null,null,"CHE XUERONG","084012H03","SM2","SM2-RP","Single","EEE"]
[null,null,null,"ZHANG YUNFAN","084016E03","SM3","SM2-AP/SM3","Single","EEE"]
[null,null,null,"LIU HAN","084035J03","SM3","SM2-AP/SM3","Single","EEE"]
[null,null,null,"CHEN XIANGCHEN","084056F03","SM2","SM2-RP",{"$f":"VLOOKUP(I$1:I$5281,$A$37:$B$212,2,FALSE)","v":"Single"},"EEE"]
[null,null,null,"PATWARDHAN SHREE BALWANT","084068B03","SIA-NOL","No bridging","Single","EEE"]
[null,null,null,"DONG JINGJING","084077C03","SM3","SM2-AP/SM3","Single","EEE"]
[null,null,null,"KONG WEISHENG","084106F03","SM2","SM2-RP","Single","EEE"]
[null,null,null,"LI SIYU","084107H03","SM2","SM2-RP","Single","CEE"]
[null,null,null,"AN SHUO","084127C03","SM2","SM2-RP","Single","EEE"]
[null,null,null,"LI JIAN","084128E03","SM2","SM2-RP","Single","EEE"]
[null,null,null,"MUTIASANI DIANMARTI KUSUMA","084136D03","Sembcorp","No bridging","Single","CEE"]
[null,null,null,"WU ZHIGUANG","084141H03","SM3","SM2-AP/SM3","Single","EEE"]
[null,null,null,"DENG LIXI","084144C03","SM2","SM2-RP","Single","ME"]
[null,null,null,"AMITABH AWASTHI","084146G03","SIA-NOL","No bridging","Single","EEE"]
[null,null,null,"FEI FAN","084178J03","SM3","SM2-AP/SM3","Single","EEE"]
[null,null,null,"YANG XI","084180G03","SM2","SM2-RP","Single","EEE"]
[null,null,null,"LIN SUBAO","084190K03","SM2","SM2-RP","Single","EEE"]
[null,null,null,"PENG JINGMING","084195J03","SM3","SM2-AP/SM3","Single","EEE"]
[null,null,null,"XIAO CHEN","084210A03","SM3","SM2-AP/SM3","Single","ENE"]
[null,null,null,"DOU WENBO","084234D03","SM3","SM2-AP/SM3","Single","EEE"]
[null,null,null,"FU YONGYI","084250B03","SM3","SM2-AP/SM3","Single","EEE"]
[null,null,null,"ZHAO XIHUI","084252F03","SM2","SM2-RP","Single","EEE"]
[null,null,null,"MARIO KRISTIANTO HALIM","084273C03","Sembcorp","No bridging","Single","EEE"]
[null,null,null,"YIN TENGLONG","084283F03","MOE PreU Scholar (PRC)","No bridging","Single","EEE"]
[null,null,null,"YANG CHAO","084314B03","SM3","SM2-AP/SM3","Single","MAT"]
[null,null,null,"ZHANG TIANHANG","084321K03","SM3","SM2-AP/SM3","Single","EEE"]
[null,null,null,"CHEN HAO","084356G03","SM2","SM2-RP","Single","EEE"]
[null,null,null,"WEN BIHAN","084366K03","SM2","SM2-RP","Single","EEE"]
[null,null,null,"ZOU HAN","084367A03","SM2","SM2-RP","Single","EEE"]
[null,null,null,"REN ZHENGJIA","084379H03","SM3","SM2-AP/SM3","Single","EEE"]
[null,null,null,"GOPALAKRISHNAN SAI APARAJITHA","084384A03","SIA-NOL","No bridging","Single","EEE"]
[null,null,null,"XIAO ZHEKAI","084394D03","SM3","SM2-AP/SM3","Single","EEE"]
[null,null,null,"XU LIYE","084396H03","SM3","SM2-AP/SM3","Single","EEE"]
[null,null,null,"ZHANG SHUWANG","084400F03","SM2","SM2-RP","Single","EEE"]
[null,null,null,"PENG BO","084423G03","SM3","SM2-AP/SM3","Single","EEE"]
[null,null,null,"LI XIN","084427D03","SM3","SM2-AP/SM3","Single","EEE"]
[null,null,null,"SUN BOYUAN","084428F03","SM3","SM2-AP/SM3","Single","EEE"]
[null,null,null,"YOSUA MICHAEL MARANATHA","084433K03","Sembcorp","No bridging","Single","MATH"]
[null,null,null,"JIANG XIAOYI","084452C03","SM3","SM2-AP/SM3","Single","EEE"]
[null,null,null,"SARVESH SUDHIR NEVATIA","084455J03","SIA-NOL","No bridging","Single","ME"]
[null,null,null,"YE JIANKANG","084458D03","SM3","SM2-AP/SM3","Single","ME"]
[null,null,null,"LI XIANG","084470E03","SM3","SM2-AP/SM3","Single","EEE"]
[null,null,null,"CAI TIANYU","084494H03","SM2","SM2-RP","Single","EEE"]
[null,null,null,"GE ZHUORAN","084516C03","SM2","SM2-RP","Single","EEE"]
[null,null,null,"ZHANG XU","084531K03","SM2","SM2-RP","Single","EEE"]
[null,null,null,"MA JIE","084538B03","SM2","SM2-RP","Single","ME"]
[null,null,null,"SRINATH GOVINDARAJAN","084552G03","SIA-NOL","No bridging","Single","EEE"]
[null,null,null,"QIAN XING","084578C03","SM2","SM2-RP","Single","EEE"]
[null,null,null,"YUAN LIN","084580A03","SM3","SM2-AP/SM3","Single","ME"]
[null,null,null,"HOU RUI","084597G03","SM3","SM2-AP/SM3","Single","EEE"]
[null,null,null,"DENG QINFEI","084602G03","SM2","SM2-RP","Single","EEE"]
[null,null,null,"XU QIAN","084608H03","SM2 (Accelerated)","SM2-AP/SM3","Single","EEE"]
[null,null,null,"VIJAYADITYA INDRAKANTI","084611H03","SIA-NOL","No bridging","Single","EEE"]
[null,null,null,"ZHANG YANG","084620J03","SM2","SM2-RP","Single","EEE"]
[null,null,null,"WU ZUOBIN","084624F03","SM2","SM2-RP","Single","EEE"]
[null,null,null,"CAI YANG","084653B03","SM2","SM2-RP","Single","EEE"]
[null,null,null,"ZHANG CHENGZHI","084664G03","SM3","SM2-AP/SM3","Single","EEE"]
[null,null,null,"XU WENFAN","084671D03","SM3","SM2-AP/SM3","Single","EEE"]
[null,null,null,"KANG TUO","084701J03","SM3","SM2-AP/SM3","Single","ME"]
[null,null,null,"JIANG JIZE","084704D03","SM3","SM2-AP/SM3","Single","EEE"]
[null,null,null,"ZHU CHAO","084715J03","SM3","SM2-AP/SM3","Single","EEE"]
[null,null,null,"THOMAS AQUINAS NUGRAHA BUDI","084727E03","Sembcorp","No bridging","Single","EEE"]
[null,null,null,"TEGUH SANTOSO LEMBONO","084731G03","Sembcorp","No bridging","Single","ME"]
[null,null,null,"SUN JIN","084745G03","SM2","SM2-RP","Single","EEE"]
[null,null,null,"ZHAO YIAN","084750L03","SM3","SM2-AP/SM3","Single","ME"]
[null,null,null,"WANG YOUZI","084753F03","SM2","SM2-RP","Single","EEE"]
[null,null,null,"XU MUYE","084778L03","SM2","SM2-RP","Single","EEE"]
[null,null,null,"YANG JING","084780J03","SM3","SM2-AP/SM3",{"$f":"VLOOKUP(I$1:I$5281,$A$37:$B$212,2,FALSE)","v":"Single"},"EEE"]
[null,null,null,"ZENG JING","084789E03","SM3","SM2-AP/SM3","Single","ENE"]
[null,null,null,"DING YUZHOU","084814L03","SM2 (Accelerated)","SM2-AP/SM3","Single","EEE"]
[null,null,null,"HE CHENGJUN","084815B03","SM2","SM2-RP","Single","EEE"]
[null,null,null,"HUANG GUOZHU","084833D03","SM3","SM2-AP/SM3","Single","ME"]
[null,null,null,"YU JIA","084836K03","SM3","SM2-AP/SM3","Single","EEE"]
[null,null,null,"ZHENG WEIQIN","084837A03","SM2","SM2-RP","Single","EEE"]
[null,null,null,"YU JIANQI","084849H03","SM3","SM2-AP/SM3","Single","EEE"]
[null,null,null,"NITISH KHANNA","084852H03","SIA-NOL","No bridging","Single","EEE"]
[null,null,null,"XIE WANLU","084871A03","SM2","SM2-RP","Single","EEE"]
[null,null,null,"AMANDA SUWANTO","084889J03","Sembcorp","No bridging","Single","EEE"]
[null,null,null,"XU JIANTAO","084897H03","SM2","SM2-RP","Single","EEE"]
[null,null,null,"GRANT DINARTO","084902H03","Sembcorp","No bridging","Single","EEE"]
[null,null,null,"DENG YUCHEN","084903K03","SM2","SM2-RP","Single","EEE"]
[null,null,null,"TIAN PENG","084904A03","SM3","SM2-AP/SM3","Single","EEE"]
[null,null,null,"MAO JUNCHI","084914D03","SM3","SM2-AP/SM3","Single","EEE"]
[null,null,null,"WANG WEIMIN","084925J03","SM2 (Accelerated)","SM2-AP/SM3","Single","EEE"]
[null,null,null,"YANG LIU","084928D03","SM3","SM2-AP/SM3","Single","EEE"]
[null,null,null,"WANG WEIRUI","084945D03","SM2","SM2-RP","Single","CEE"]
[null,null,null,"ZHOU QI","084948K03","SM3","SM2-AP/SM3","Single","EEE"]
[null,null,null,"WANG SHUAI","084952A03","SM3","SM2-AP/SM3","Single","EEE"]
[null,null,null,"YAN YUANYUAN","084956J03","SM3","SM2-AP/SM3","Single","EEE"]
[null,null,null,"WANG QIAN","084962D03","SM2","SM2-RP","Single","EEE"]
[null,null,null,"AI TIANYU","084964H03","SM3","SM2-AP/SM3","Single","EEE"]
[null,null,null,"LIANG YUNFENG","085017C03","SM3","SM2-AP/SM3","Single","EEE"]
[null,null,null,"HU JIPENG","085024L03","SM3","SM2-AP/SM3","Single","ENE"]
[null,null,null,"JIAO ZHENG","085028H03","SM2 (Accelerated)","SM2-AP/SM3","Single","EEE"]
[null,null,null,"ZHOU KE","085054J03","SM2 (Accelerated)","SM2-AP/SM3","Single","EEE"]
[null,null,null,"WANG HAN","085059H03","SM2","SM2-RP","Single","EEE"]
[null,null,null,"DONG LIANG","085075F03","SM3","SM2-AP/SM3","Single","EEE"]
[null,null,null,"ZHANG XUEYING","085078A03","SM2","SM2-RP","Single","EEE"]
[null,null,null,"YURICO WIRAHADI","085088D03","Sembcorp","No bridging","Single","EEE"]
[null,null,null,"QIU ZHONGYAO","085091D03","SM3","SM2-AP/SM3","Single","ME"]
[null,null,null,"DENG XIN","085103G03","SM2","SM2-RP","Single","EEE"]
[null,null,null,"GUO LIZAO","085104J03","SM3","SM2-AP/SM3","Single","EEE"]
[null,null,null,"XIONG YIFANG","085121J03","SM2","SM2-RP","Single","EEE"]
[null,null,null,"TJOA ELISSA SITAWATI","085126H03","Sembcorp","No bridging","Single","EEE"]
[null,null,null,"XIAO ZHUDI","085131A03","SM3","SM2-AP/SM3","Single","AERO"]
[null,null,null,"QIU GUANGJU","085140B03","SM3","SM2-AP/SM3","Single","EEE"]
[null,null,null,"ZHU YUSI","085157H03","SM3","SM2-AP/SM3","Single","CEE"]
[null,null,null,"HE JIANGMING","085167L03","SM3","SM2-AP/SM3","Single","ME"]
[null,null,null,"WANG BING","085168B03","SM2","SM2-RP","Single","ME"]
[null,null,null,"WU QINGHUA","085173F03","SM2 (Accelerated)","SM2-AP/SM3","Single","EEE"]
[null,null,null,"LIU YIYING","085183J03","SM3","SM2-AP/SM3","Single","EEE"]
[null,null,null,"VAIBHAV VIJ","085192K03","SIA-NOL","No bridging","Single","EEE"]
[null,null,null,"ZHANG RUI","085195E03","SM2","SM2-RP","Single","EEE"]
[null,null,null,"YU WENZHI","085200E03","SM3","SM2-AP/SM3","Single","EEE"]
[null,null,null,"ZHOU JIAXI","085216J03","SM3","SM2-AP/SM3","Single","EEE"]
[null,null,null,"YANG ZHIBIN","085232G03","SM3","SM2-AP/SM3","Single","ME"]
[null,null,null,"YUAN SHUO","085236D03","SM3","SM2-AP/SM3","Single","EEE"]
[null,null,null,"LAI SHUPENG","085245E03","SM2","SM2-RP","Single","EEE"]
[null,null,null,"LIN MAOQING","085255J53","SM2","SM2-RP","Single","IEM"]
[null,null,null,"SU BAOLAI","085257B53","SM3","SM2-AP/SM3","Single","IEM"]
[null,null,null,"LIU ZHE","085262F53","SM2","SM2-RP","Single","IEM"]
[null,null,null,"XU LI","085264K53","SM2","SM2-RP","Single","IEM"]
[null,null,null,"LIU SIJIA","085268G53","SM3","SM2-AP/SM3","Single","IEM"]
[null,null,null,"ZHANG YUZHUO","085269J53","SM2","SM2-RP","Single","IEM"]
[null,null,null,"DING JINHUA","085273L53","SM3","SM2-AP/SM3","Single","IEM"]
[null,null,null,"SONG QIAOQI","085274B53","SM2","SM2-RP","Single","IEM"]
[null,null,null,"WEI YAGUANG","085275D53","SM2","SM2-RP","Single","IEM"]
[null,null,null,"ZHOU MENGYU","085278K53","SM2","SM2-RP","Single","IEM"]
[null,null,null,"MA YIWEI","085279A53","SM2","SM2-RP","Single","IEM"]
[null,null,null,"ZHANG LEYU","085280H53","SM2","SM2-RP","Single","IEM"]
[null,null,null,"QIU SIYUAN","085281K53","SM3","SM2-AP/SM3","Single","IEM"]
[null,null,null,"SUN JIAPEI","085283C53","SM2","SM2-RP",{"$f":"VLOOKUP(I$1:I$5281,$A$37:$B$212,2,FALSE)","v":"Single"},"IEM"]
[null,null,null,"LI JINGYA","085286J53","SM3","SM2-AP/SM3","Single","IEM"]
[null,null,null,"WANG JINGJING","085288B53","SM3","SM2-AP/SM3","Single","IEM"]
[null,null,null,"XIONG CHENXI","085291B53","SM2","SM2-RP","Single","IEM"]
[null,null,null,"TAO LINGZHE","085309F53","SM2","SM2-RP","Single","EEE"]
[null,null,null,"ZHENG TIANXING","085414A50","SM2","SM2-RP","Double (Type 2)","EEEC"]
[null,null,null,"HE KE","085428A50","SM2","SM2-RP","Double (Type 2)","MTEC"]
[null,null,null,"YU FANG","085440B50","SM2","SM2-RP","Double (Type 2)","IEEC"]
[null,null,null,"HE RUN","085459D06","SM2","SM2-RP","Single","CE"]
[null,null,null,"PAVANI GULATI","085466A06","SIA-NOL","No bridging","Single","CSC"]
[null,null,null,"SHI YAN","085471E06","SM3","SM2-AP/SM3","Single","CE"]
[null,null,null,"ZHANG LIZI","085483A06","SM3","SM2-AP/SM3","Single","CSC"]
[null,null,null,"XIA WEIHUA","085497A06","SM3","SM2-AP/SM3","Single","CE"]
[null,null,null,"KANIKA BANSAL","085502A06","SIA-NOL","No bridging","Single","CE"]
[null,null,null,"MENG YANG","085505G06","SM3","SM2-AP/SM3","Single","CSC"]
[null,null,null,"ZHANG HAILONG","085520C06","SM3","SM2-AP/SM3","Single","CE"]
[null,null,null,"FENDY L FEBRIANTO","085522G06","Sembcorp","No bridging","Single","CSC"]
[null,null,null,"GUO HAO","085536G06","SM2","SM2-RP","Single","CE"]
[null,null,null,"FU SHENGWEN","085537J06","SM3","SM2-AP/SM3","Single","CSC"]
[null,null,null,"BILAL RIZVI","085547A06","SIA-NOL","No bridging","Single","CSC"]
[null,null,null,"VIJAY KAMATH","085553G06","SIA-NOL","No bridging","Single","CE"]
[null,null,null,"BHARATH VIJAY PALUKURTHI","085556B06","SIA-NOL","No bridging","Single","CSC"]
[null,null,null,"DOYEN SAHOO","085557D06","SIA-NOL","No bridging","Single","CSC"]
[null,null,null,"QI LIN","085571J06","SM3","SM2-AP/SM3","Single","CSC"]
[null,null,null,"MITHUN PANEKAT","085576H06","SIA-NOL","No bridging","Single","CSC"]
[null,null,null,"SIDDHANT JAIN","085577K06","SIA-NOL","No bridging","Single","CE"]
[null,null,null,"AYUSH SINGHAL","085587B06","SIA-NOL","No bridging","Single","CE"]
[null,null,null,"LI SIYI","085595A06","SM3","SM2-AP/SM3","Single","CSC"]
[null,null,null,"SRIRAMKUMAR BALASUBRAMANIAN","085601C06","SIA-NOL","No bridging","Single","CSC"]
[null,null,null,"PUSHKAR SHUKLA","085604J06","SIA-NOL","No bridging","Single","CE"]
[null,null,null,"ROHIT PARAG SAMARTH","085607D06","SIA-NOL","No bridging","Single","CSC"]
[null,null,null,"MATHURA VAIDYANATHAN","085608F06","SIA-NOL","No bridging","Single","CSC"]
[null,null,null,"NEETIKA BANSAL","085621J06","SIA-NOL","No bridging","Single","CE"]
[null,null,null,"CHINMAY MALAVIYA","085640B06","SIA-NOL","No bridging","Single","CE"]
[null,null,null,"ABHISHEK RAY","085660H06","SIA-NOL","No bridging","Single","CE"]
[null,null,null,"ZHANG GE","085672D06","SM3","SM2-AP/SM3","Single","CE"]
[null,null,null,"CHEN LUCAN","085675K06","SM3","SM2-AP/SM3","Single","CE"]
[null,null,null,"ZHANG MINGMIN","085679G06","SM3","SM2-AP/SM3","Single","CE"]
[null,null,null,"SHIVOHNE MARY ANNE SALDANHA","085680C06","SIA-NOL","No bridging","Single","CSC"]
[null,null,null,"SUN YANAN","085705D06","SM3","SM2-AP/SM3","Single","CE"]
[null,null,null,"KRISHNAMOORTHY SHREERANJANI","085707H06","SIA-NOL","No bridging","Single","CE"]
[null,null,null,"LIANG XIAOLONG","085755H06","SM2","SM2-RP","Single","CE"]
[null,null,null,"WAN MENGYUN","085756K06","SM3","SM2-AP/SM3","Single","CE"]
[null,null,null,"HUANG HAO","085761C06","SM3","SM2-AP/SM3","Single","CE"]
[null,null,null,"WANG XIAOHUI","085776E06","SM3","SM2-AP/SM3","Single","CE"]
[null,null,null,"UDIT BATRA","085777G06","SIA-NOL","No bridging","Single","CE"]
[null,null,null,"NITIN GARG","085784D06","SIA Youth","No bridging","Single","CE"]
[null,null,null,"BIJU JOSEPH JACOB","085786H06","SIA-NOL","No bridging","Single","CSC"]
[null,null,null,"LU GUOGUANG","085799F06","SM2 (Accelerated)","SM2-AP/SM3","Single","CSC"]
[null,null,null,"RAPHAEL ARDYANTO SUNARDI","085804F06","Sembcorp","No bridging","Single","CE"]
[null,null,null,"BHAVDEEP SINGH","085811C06","SIA-NOL","No bridging","Single","CSC"]
[null,null,null,"SAUMYA MOHAN","085813G06","SIA Youth","No bridging","Single","CSC"]
[null,null,null,"CAO SHAN","085819H06","SM2","SM2-RP","Single","CE"]
[null,null,null,"CHEN ZHE","085823K06","SM3","SM2-AP/SM3","Single","CE"]
[null,null,null,"NITISH RAMKUMAR","085837K06","SIA-NOL","No bridging","Single","CSC"]
[null,null,null,"MILIND GANJOO","085838A06","SIA-NOL","No bridging","Single","CSC"]
[null,null,null,"WENG XIAOJUN","085840K06","SM3","SM2-AP/SM3","Single","CE"]
[null,null,null,"HUANG YUE","085850B06","SM3","SM2-AP/SM3","Single","CE"]
[null,null,null,"ADITYA BANSAL","085852F06","SIA-NOL","No bridging","Single","CSC"]
[null,null,null,"ANIRUDH NARLA","085855A06","SIA-NOL","No bridging","Single","CE"]
[null,null,null,"LUO SENYUAN","085856C06","SM2","SM2-RP","Single","CSC"]
[null,null,null,"LI HUI","085858G06","SM3","SM2-AP/SM3","Single","CE"]
[null,null,null,"DENG TENG","085865D06","SM3","SM2-AP/SM3","Single","CE"]
[null,null,null,"EKTA GARODIA","085866F06","SIA-NOL","No bridging","Single","CSC"]
[null,null,null,"FU CHAO","085868K06","SM3","SM2-AP/SM3",{"$f":"VLOOKUP(I$1:I$5281,$A$37:$B$212,2,FALSE)","v":"Single"},"CE"]
[null,null,null,"CAI HAOLAN","085900E18","SM2","SM2-RP","Double (Type 1)","BCG"]
[null,null,null,"CHEN ZHISHENG","085917L18","SM3","SM2-AP/SM3","Double (Type 1)","BCG"]
[null,null,null,"LIU YANG","085921B18","SM2 (Accelerated)","SM2-AP/SM3","Double (Type 1)","BCG"]
[null,null,null,"PAN SHU","085924H18","SM2","SM2-RP","Double (Type 1)","BCG"]
[null,null,null,"LIU FANGYU","086017E14","SM2","SM2-RP","Single","MS"]
[null,null,null,"CAO JING","086031K14","SM3","SM2-AP/SM3","Single","MS"]
[null,null,null,"LAI YUWEN","086049G14","SM2","SM2-RP","Single","MS"]
[null,null,null,"JIANG MING","086062K14","SM2","SM2-RP","Single","MS"]
[null,null,null,"ZHANG LI","086067J14","SM3","SM2-AP/SM3","Single","MS"]
[null,null,null,"LI JIAYIN","086072B14","SM3","SM2-AP/SM3","Single","MS"]
[null,null,null,"BAO WEI","086078C14","SM2","SM2-RP","Single","MS"]
[null,null,null,"HAN PEINAN","086083G14","SM2","SM2-RP","Single","MS"]
[null,null,null,"HUANG LULU","086099L14","MOE PreU Scholar (PRC)","No bridging","Single","MS"]
[null,null,null,"ADY SUWARDI","086121D07","Sembcorp","No bridging","Single","MAT"]
[null,null,null,"CHENG TING","086127E07","SM3","SM2-AP/SM3","Single","MAT"]
[null,null,null,"TELLY HERAWATI HARTONO","086149D07","Sembcorp","No bridging","Single","MAT"]
[null,null,null,"YE SHENG","086150L07","SM2","SM2-RP","Single","MAT"]
[null,null,null,"ZHANG JIAZHEN","086151B07","SM3","SM2-AP/SM3","Single","MAT"]
[null,null,null,"FU WEITONG","086158E07","SM3","SM3","Single","MAT"]
[null,null,null,"LI FENGSHI","086162G07","SM2","SM2-RP","Single","MAT"]
[null,null,null,"ZHAO WENBO","086163J07","SM2","SM2-RP","Single","MAT"]
[null,null,null,"GE TINGTING","086165B07","SM2","SM2-RP","Single","MAT"]
[null,null,null,"HUANG SHENGNAN","086175E07","SM3","SM2-AP/SM3","Single","MAT"]
[null,null,null,"WANG YATING","086178L07","SM2","SM2-RP","Single","MAT"]
[null,null,null,"XU JINGCAO","086180J07","SM2 (Accelerated)","SM2-AP/SM3","Single","MAT"]
[null,null,null,"YAO DI","086182B07","SM2","SM2-RP","Single","MAT"]
[null,null,null,"ZHAO CHENNA","086187A07","SM2","SM2-RP","Single","MAT"]
[null,null,null,"SUN KUO","086191C07","SM2","SM2-RP","Single","MAT"]
[null,null,null,"ARISTO MUKTABAR","086203F07","Sembcorp","No bridging","Single","MAT"]
[null,null,null,"ZHANG YU","086206A07","SM3","SM2-AP/SM3","Single","MAT"]
[null,null,null,"LIU SHUN","086216D07","SM3","SM2-AP/SM3","Single","MAT"]
[null,null,null,"DENG RAN","086240A07","SM2","SM2-RP","Single","MAT"]
[null,null,null,"JIANG YUZHU","086249H07","SM3","SM2-AP/SM3","Single","MAT"]
[null,null,null,"WU YUANYUAN","086299A07","SM3","SM2-AP/SM3","Single","MAT"]
[null,null,null,"LI YANQING","086308J07","SM2","SM2-RP","Single","MAT"]
[null,null,null,"DONG YINONG","086311J07","SM2","SM2-RP","Single","MAT"]
[null,null,null,"LIN YUAN","086322C07","SM2","SM2-RP","Single","MAT"]
[null,null,null,"YU YUE","086328D07","SM2","SM2-RP","Single","MAT"]
[null,null,null,"DENG JIYANG","086332F07","SM3","SM2-AP/SM3","Single","MAT"]
[null,null,null,"WANG JIAXIN","086333H07","SM2","SM2-RP","Single","MAT"]
[null,null,null,"ZHANG KERAN","086336C07","SM2","SM2-RP","Single","MAT"]
[null,null,null,"WANG PUQUN","086342J07","SM3","SM2-AP/SM3","Single","MAT"]
[null,null,null,"YAO BINGXIN","086345D07","SM2","SM2-RP","Single","MAT"]
[null,null,null,"CHEN HU","086351K07","SM3","SM2-AP/SM3","Single","MAT"]
[null,null,null,"XIAO HONGLING","086354E07","SM2","SM2-RP","Single","MAT"]
[null,null,null,"MENG XIANG","086358B07","SM3","SM2-AP/SM3","Single","MAT"]
[null,null,null,"WANG MENGFEI","086362D07","SM2","SM2-RP","Single","MAT"]
[null,null,null,"LI XINTANG","086363F07","SM2","SM2-RP","Single","MAT"]
[null,null,null,"MELISA KASLAN","086415D11","Sembcorp","No bridging","Single","BS"]
[null,null,null,"ROSWITHA MUNTIYARSO","086459B11","Sembcorp","No bridging","Single","BS"]
[null,null,null,"PAN SIJUN","086821L16","SM3","SM2-AP/SM3","Single","CHEM"]
[null,null,null,"CHEN JIATENG","086862C16","SM3","SM2-AP/SM3","Single","PHY"]
[null,null,null,"JIN TIAN","086876C16","SM2","SM2-RP","Single","CHEM"]
[null,null,null,"ZHU YUXUAN","086882J16","SM2","SM2-RP","Single","PHY"]
[null,null,null,"XU RAN","086888K16","SM3","SM2-AP/SM3","Single","MATH"]
[null,null,null,"STEVEN PRAMONO","087070K16","Sembcorp","No bridging","Single","CHEM"]
[null,null,null,"FU JING","087103K16","SM2","SM2-RP","Single","CHEM"]
[null,null,null,"SONG YU","087164H16","SM2","SM2-RP","Single","PHY"]
[null,null,null,"WANG XUEOU","087199E16","SM3","SM2-AP/SM3","Single","MATH"]
[null,null,null,"WEI DANDAN","087242B16","SM3","SM2-AP/SM3","Single","MATH"]
[null,null,null,"OUYANG YI","087259H16","SM2","SM2-RP","Single","MATH"]
[null,null,null,"YU PEIYUAN","087269L16","SM2","SM2-RP","Single","CHEM"]
[null,null,null,"MADE SURYA ADHIWIRAWAN","087280K16","Sembcorp","No bridging","Single","PHY"]
[null,null,null,"ZHAO DANFENG","087317G16","SM2","SM2-RP",{"$f":"VLOOKUP(I$1:I$5281,$A$37:$B$212,2,FALSE)","v":"Single"},"MATH"]
[null,null,null,"YU TIANYUAN","087322L16","SM2","SM2-RP","Single","PHY"]
[null,null,null,"CHEN GUANQING","087325F16","SM3","SM2-AP/SM3","Single","MATH"]
[null,null,null,"LEI HAO","087336L16","SM3","SM2-AP/SM3","Single","MATH"]
[null,null,null,"SONG JINGTING","087380C16","SM2","SM2-RP","Single","CHEM"]
[null,null,null,"TAO BIAOSHUAI","087393A16","SM2","SM2-RP","Single","MATH"]
[null,null,null,"WANG XIAOLU","087419D16","SM3","SM2-AP/SM3","Single","MAEC"]
[null,null,null,"WANG CHAO","087420L16","SM2","SM2-RP","Single","MATH"]
[null,null,null,"YE KEHAN","087442K16","SM3","SM2-AP/SM3","Single","CHEM"]
[null,null,null,"WANG SHUAI","087456K16","SM3","SM2-AP/SM3","Single","MATH"]
[null,null,null,"XIE QIAN","087483B16","SM3","SM2-AP/SM3","Single","MATH"]
[null,null,null,"HU XIAOLI","087500J16","SM3","SM2-AP/SM3","Single","MAEC"]
[null,null,null,"TENG SIKE","087503D16","SM2","SM2-RP","Single","MAEC"]
[null,null,null,"WU TIANQI","087517J20","SM3","SM2-AP/SM3","Single","MAEC"]
[null,null,null,"SHAO JIALI","087520J20","SM2 (Accelerated)","SM2-AP/SM3","Single","MAEC"]
[null,null,null,"SUN GONGSHI","087522B20","SM2","SM2-RP","Single","MAEC"]
[null,null,null,"WU XUEFEI","087525H20","SM3","SM2-AP/SM3","Single","MAEC"]
[null,null,null,"WANG JINGYI","087530A20","SM2","SM2-RP","Single","MAEC"]
[null,null,null,"XU SHOUQI","087531C20","SM2","SM2-RP","Single","MAEC"]
[null,null,null,"ZHANG WEI","087533G20","MOE PreU Scholar (PRC)","No bridging","Single","MAEC"]
[null,null,null,"ZHANG WENJIA","087539H20","SM2 (Accelerated)","SM2-AP/SM3","Single","MAEC"]
[null,null,null,"ZHANG WEIRU","087541F20","SM2","SM2-RP","Single","MAEC"]
[null,null,null,"WANG YI","087545C20","SM2","SM2-RP","Single","MAEC"]
[null,null,null,"YUE MU","087547G20","SM2","SM2-RP","Single","MAEC"]
[null,null,null,"YE HONGHAI","087555F20","SM2","SM2-RP","Single","MAEC"]
[null,null,null,"SONG QIUSI","087556H20","MOE PreU Scholar (PRC)","No bridging","Single","MAEC"]
[null,null,null,"ZHANG XIUYA","087559C20","SM3","SM2-AP/SM3","Single","MAEC"]
[null,null,null,"SHAO YU","087561A20","SM2","SM2-RP","Single","MAEC"]
[null,null,null,"XU HAN","087566L20","SM3","SM2-AP/SM3","Single","MAEC"]
[null,null,null,"TIAN XUE","087576C20","SM3","SM2-AP/SM3","Single","MAEC"]
[null,null,null,"TAO YE","087577E20","SM2","SM2-RP","Single","MAEC"]
[null,null,null,"QUAN JUN","087582J20","SM3","SM2-AP/SM3","Single","MAEC"]
[null,null,null,"XIE WENJUN","087592A20","SM2 (Accelerated)","SM2-AP/SM3","Single","MATH"]
[null,null,null,"XU JIAJIA","087594E20","SM3","SM2-AP/SM3","Single","MAEC"]
[null,null,null,"HANG TIANYU","087597L20","SM2","SM2-RP","Single","MAEC"]
[null,null,null,"WU KEYUAN","087606H20","SM2","SM2-RP","Single","MAEC"]
[null,null,null,"LU YAOREN","087608A20","SM2 (Accelerated)","SM2-AP/SM3","Single","MAEC"]
[null,null,null,"ZHANG QIQI","087614G20","SM3","SM2-AP/SM3","Single","MAEC"]
[null,null,null,"CUI HENGFEI","087617B20","SM3","SM2-AP/SM3","Single","MAEC"]
[null,null,null,"LU XI","087620B20","SM2","SM2-RP","Single","MAEC"]
[null,null,null,"LI SIWEI","087621D20","SM2 (Accelerated)","SM2-AP/SM3","Single","MAEC"]
[null,null,null,"SHEN KAI","087624K20","SM2","SM2-RP","Single","MAEC"]
[null,null,null,"LI JUCAI","087630E20","SM3","SM2-AP/SM3","Single","MAEC"]
[null,null,null,"XIN YU","087631G20","SM2","SM2-RP","Single","MAEC"]
[null,null,null,"WU ZHAODONG","087644E20","SM3","SM2-AP/SM3","Single","MAEC"]
[null,null,null,"WU LIN","088907G20","SM2","SM2-RP","Single","MAEC"]
[null,null,null,"LI YUNONG","088910G20","SM2","SM2-RP","Single","MAEC"]
[null,null,null,"XU WENTIAN","088912L20","SM3","SM2-AP/SM3","Single","MAEC"]
[null,null,null,"ZHANG MAN","088913B20","SM3","SM2-AP/SM3","Single","MAEC"]
[null,null,null,"YOU DONGCHEN (Douglas You)","088915F20","SM2","SM2-RP","Single","MAEC"]
[null,null,null,"ANDREW SANTOSO","U0920109G","Sembcorp","No bridging","Single","ME"]
[null,null,null,"MARIA FRANSISKA TANUJAYA","U0920230H","Sembcorp","No bridging","Single","CBE"]
[null,null,null,"JAYARAMAN PRASHANTH","U0920538A","SIA-NOL","No bridging","Single","CBE"]
[null,null,null,"HARJOBEN SINGH","U0920551G","SIA-NOL","No bridging","Single","CE"]
[null,null,null,"VARUN BANKA","U0920553A","SIA-NOL","No bridging","Single","CE"]
[null,null,null,"YANG LINJIANG","U0920568F","MOE PreU Scholar (PRC)","No bridging","Single","CBE"]
[null,null,null,"APARNA JANARDHANAN NAMBIAR","U0920595J","SIA-NOL","No bridging","Single","IEM"]
[null,null,null,"SHI CHENWEI","U0920610J","MOE PreU Scholar (PRC)","No bridging","Single","MS"]
[null,null,null,"RAJARAMAN VENKATARAMAN","U0920619D","SIA-NOL","No bridging","Single","EEE"]
[null,null,null,"CAO FENG","U0920631B","MOE PreU Scholar (PRC)","No bridging","Single","AERO"]
[null,null,null,"ANJALI VISHWANATHAN","U0920642H","SIA-NOL","No bridging","Single","AERO"]
[null,null,null,"MEHAK NAGPAL","U0920667L","SIA-NOL","No bridging","Single","CE"]
[null,null,null,"YANG GUANG","U0920685B","MOE PreU Scholar (PRC)","No bridging","Single","CBE"]
[null,null,null,"LIU JINPENG","U0920702G","MOE PreU Scholar (PRC)","No bridging","Single","EEE"]
[null,null,null,"PRERNA MISHRA","U0920722C","SIA-NOL","No bridging",{"$f":"VLOOKUP(I$1:I$5281,$A$37:$B$212,2,FALSE)","v":"Single"},"EEE"]
[null,null,null,"TIAN YUAN","U0920739B","MOE PreU Scholar (PRC)","No bridging","Single","ENE"]
[null,null,null,"WANG HAIDONG","U0920788F","MOE PreU Scholar (PRC)","No bridging","Single","ME"]
[null,null,null,"PRIYA ANDLEIGH","U0920848E","SIA-NOL","No bridging","Single","CBE"]
[null,null,null,"SAHANA QAUNDINYA","U0921083K","SIA-NOL","No bridging","Single","CBE"]
[null,null,null,"CHENG JINGJING","U0921347A","MOE PreU Scholar (PRC)","No bridging","Single","EEE"]
[null,null,null,"GOPALAKRISHNAN VIGNESH","U0921419C","SIA-NOL","No bridging","Single","EEE"]
[null,null,null,"VARUN SUBRAMANIAN","U0921587H","SIA-NOL","No bridging","Single","CSC"]
[null,null,null,"VENUGOPALAN THARUVAI KRISHNASWAMY","U0922273H","SIA-NOL","No bridging","Single","EEE"]
[null,null,null,"SANJANA IYER","U0922276K","SIA-NOL","No bridging","Single","EEE"]
[null,null,null,"MOHIT MEHROTRA","U0922324F","SIA-NOL","No bridging","Single","EEE"]
[null,null,null,"DU JING","U0922462F","MOE PreU Scholar (PRC)","No bridging","Single","MS"]
[null,null,null,"PRANAV ASHOK","U0922637A","SIA-NOL","No bridging","Single","CSC"]
[null,null,null,"AANSHU MISHRA","U0922790A","SIA-NOL","No bridging","Single","EEE"]
[null,null,null,"SINDHU SRINATH ADHONI","U0922827G","SIA Youth","No bridging","Single","BIE"]
[null,null,null,"ARJUN","U0922947E","SIA-NOL","No bridging","Single","ME"]
[null,null,null,"GOKUL JAYARAM","U0922959H","SIA-NOL","No bridging","Single","EEE"]
[null,null,null,"FENG LUSHA","U0923036F","SM2","SM2-RP","Single","IEM"]
[null,null,null,"YAO XILING","U0923037C","SM2","SM2-RP","Single","ME"]
[null,null,null,"LONG XIN","U0923038L","SM2","SM2-RP","Single","MAT"]
[null,null,null,"ZHANG LIYU","U0923039H","SM2","SM2-RP","Single","EEE"]
[null,null,null,"XU YIMING","U0923040L","SM2","SM2-RP","Single","MS"]
[null,null,null,"CHEN LONG","U0923041H","SM2","SM2-RP","Single","CE"]
[null,null,null,"WANG MENG","U0923042E","SM2","SM2-RP","Single","EEE"]
[null,null,null,"KONG QINGYANG","U0923043B","SM2","SM2-RP","Single","CEE"]
[null,null,null,"XIA QIAN","U0923044K","SM2","SM2-RP","Single","MAT"]
[null,null,null,"HE SHUAI","U0923045G","SM2","SM2-RP","Single","BIE"]
[null,null,null,"GE YAO","U0923046D","SM2","SM2-RP","Single","EEE"]
[null,null,null,"MAO NING","U0923047A","SM2","SM2-RP","Single","BIE"]
[null,null,null,"CAO WENFANG","U0923049F","SM2","SM2-RP","Single","MAT"]
[null,null,null,"WU RAN","U0923050J","SM2","SM2-RP","Single","CBE"]
[null,null,null,"ZUO ENQING","U0923051F","SM2","SM2-RP","Single","EEE"]
[null,null,null,"GE YUCHEN","U0923052C","SM2","SM2-RP","Single","ME"]
[null,null,null,"ZHANG SHAOLIANG","U0923053L","SM2","SM2-RP","Single","EEE"]
[null,null,null,"WU PEIXUAN","U0923054H","SM2 (Accelerated)","SM2-AP/SM3","Single","MAT"]
[null,null,null,"MA YANJING","U0923055E","SM2","SM2-RP","Single","CEE"]
[null,null,null,"ZHEN HUAIYUAN","U0923056B","SM2","SM2-RP","Single","ME"]
[null,null,null,"LI CHENCHEN","U0923057K","SM2","SM2-RP","Single","EEE"]
[null,null,null,"WANG ZIYIN","U0923058G","SM2","SM2-RP","Single","ME"]
[null,null,null,"LI SICONG","U0923059D","SM2","SM2-RP","Single","MATH"]
[null,null,null,"XIE XIAOHUI","U0923060G","SM2","SM2-RP","Single","IEM"]
[null,null,null,"SONG YUFEI","U0923061D","SM2","SM2-RP","Single","MAT"]
[null,null,null,"JIN JIA","U0923062A","SM2","SM2-RP","Single","MS"]
[null,null,null,"LIU ZHAOTONG","U0923063J","SM2","SM2-RP","Double (Type 1)","BCG"]
[null,null,null,"CUI DONGYAO","U0923064F","SM2","SM2-RP","Single","EEE"]
[null,null,null,"SU HAOFEI","U0923065C","SM2","SM2-RP","Single","CBE"]
[null,null,null,"NIAN XINGYU","U0923066L","SM2","SM2-RP","Single","EEE"]
[null,null,null,"XIONG TIANREN","U0923067H","SM2","SM2-RP","Single","EEE"]
[null,null,null,"SHEN ZHANYU","U0923068E","SM2","SM2-RP","Single","EEE"]
[null,null,null,"ZHANG MENG","U0923069B","SM2","SM2-RP","Single","EEE"]
[null,null,null,"WANG MENGRAN","U0923070E","SM2","SM2-RP","Single","EEE"]
[null,null,null,"LI FUQIANG","U0923071B","SM2","SM2-RP","Single","EEE"]
[null,null,null,"JIA TONG","U0923073G","SM2","SM2-RP","Single","CBE"]
[null,null,null,"GONG YIFEI","U0923074D","SM2","SM2-RP","Single","CSC"]
[null,null,null,"DING TINGYING","U0923075A","SM2","SM2-RP","Single","IEM"]
[null,null,null,"JIANG ZHAO","U0923076J","SM2","SM2-RP","Single","EEE"]
[null,null,null,"FAN JUNKAI","U0923077F","SM2","SM2-RP","Single","EEE"]
[null,null,null,"LUO XIANG","U0923078C","SM2","SM2-RP","Single","EEE"]
[null,null,null,"CAO BUQING","U0923079L","SM2","SM2-RP","Single","EEE"]
[null,null,null,"WANG ZHI","U0923080C","SM2","SM2-RP","Single","EEE"]
[null,null,null,"AN JINGCHEN","U0923081L","SM2","SM2-RP","Single","EEE"]
[null,null,null,"HE YUQING","U0923082H","SM2","SM2-RP","Single","EEE"]
[null,null,null,"GUO WEI","U0923083E","SM2","SM2-RP","Single","EEE"]
[null,null,null,"XIA JI","U0923084B","SM2","SM2-RP","Single","EEE"]
[null,null,null,"ZHANG HAOLIN","U0923085K","SM2","SM2-RP",{"$f":"VLOOKUP(I$1:I$5281,$A$37:$B$212,2,FALSE)","v":"Single"},"CE"]
[null,null,null,"ZHANG XIYAO","U0923086G","SM2","SM2-RP","Single","CBE"]
[null,null,null,"LIU CHANG","U0923088A","SM2","SM2-RP","Single","MAT"]
[null,null,null,"LIU YAKUN","U0923089J","SM2 (Accelerated)","SM2-AP/SM3","Single","EEE"]
[null,null,null,"LI JUNJIE","U0923090A","SM2","SM2-RP","Single","MATH"]
[null,null,null,"HE YAN","U0923092F","SM2","SM2-RP","Single","EEE"]
[null,null,null,"WANG LIKUN","U0923093C","SM2","SM2-RP","Single","EEE"]
[null,null,null,"WEI ZHENZI","U0923094L","SM2","SM2-RP","Single","IEM"]
[null,null,null,"CUI KEER","U0923095H","SM3","SM2-AP/SM3","Single","EEE"]
[null,null,null,"HUA YUNKE","U0923096E","SM2","SM2-RP","Single","IEM"]
[null,null,null,"CUI YUCHI","U0923097B","SM2","SM2-RP","Single","MAT"]
[null,null,null,"HUANG DONGLI","U0923099G","SM2","SM2-RP","Single","EEE"]
[null,null,null,"LI YIFEI","U0923100K","SM2 (Accelerated)","SM2-AP/SM3","Single","ME"]
[null,null,null,"FU ZHE","U0923101G","SM2 (Accelerated)","SM2-AP/SM3","Single","EEE"]
[null,null,null,"ZHU CONGFEI","U0923102D","SM2 (Accelerated)","SM2-AP/SM3","Single","EEE"]
[null,null,null,"XIA HAINA","U0923103A","SM3","SM2-AP/SM3","Single","IEM"]
[null,null,null,"PAN LEI","U0923104J","SM2 (Accelerated)","SM2-AP/SM3","Single","EEE"]
[null,null,null,"CHEN KE","U0923105F","SM3","SM2-AP/SM3","Single","EEE"]
[null,null,null,"GAO DONGFANG","U0923106C","SM3","SM2-AP/SM3","Single","EEE"]
[null,null,null,"SUN LEI","U0923107L","SM3","SM2-AP/SM3","Single","CE"]
[null,null,null,"ZHANG XINYU","U0923108H","SM3","SM2-AP/SM3","Single","CSC"]
[null,null,null,"TU YU","U0923109E","SM3","SM2-AP/SM3","Single","CBE"]
[null,null,null,"REN JIE","U0923111E","SM3","SM2-AP/SM3","Single","MAT"]
[null,null,null,"SHEN NAN","U0923112B","SM2","SM2-RP","Single","MAT"]
[null,null,null,"KANG YANG","U0923113K","SM3","SM2-AP/SM3","Single","EEE"]
[null,null,null,"YU YANG","U0923114G","SM3","SM2-AP/SM3","Single","MS"]
[null,null,null,"LI JUEKUN","U0923115D","SM3","SM2-AP/SM3","Single","EEE"]
[null,null,null,"LIU MIN","U0923116A","SM3","SM2-AP/SM3","Single","CBE"]
[null,null,null,"LIU YE","U0923117J","SM2","SM2-RP","Single","MAT"]
[null,null,null,"LI WANLONG","U0923118F","SM3","SM2-AP/SM3","Single","CE"]
[null,null,null,"XIONG WEI","U0923119C","SM3","SM2-AP/SM3","Single","MAT"]
[null,null,null,"ZHANG CHENYU","U0923120F","SM3","SM2-AP/SM3","Single","EEE"]
[null,null,null,"YUAN FENG","U0923121C","SM3","SM2-AP/SM3","Single","EEE"]
[null,null,null,"XIA YALI","U0923122L","SM3","SM2-AP/SM3","Single","EEE"]
[null,null,null,"HE HUIQIAO","U0923123H","SM3","SM2-AP/SM3","Single","EEE"]
[null,null,null,"LIU LUMING","U0923124E","SM2","SM2-RP","Single","EEE"]
[null,null,null,"ZHAO DAWEI","U0923125B","SM3","SM2-AP/SM3","Single","EEE"]
[null,null,null,"LIU TIANCHI","U0923126K","SM3","SM2-AP/SM3","Single","EEE"]
[null,null,null,"CHEN YAO","U0923127G","SM3","SM2-AP/SM3","Single","CSC"]
[null,null,null,"LIU ZHUOSHI","U0923128D","SM3","SM2-AP/SM3","Single","EEE"]
[null,null,null,"DU XUAN","U0923129A","SM3","SM2-AP/SM3","Single","EEE"]
[null,null,null,"ZHONG ZHAOHANG","U0923130D","SM2","SM2-RP","Single","EEE"]
[null,null,null,"LI XINYI","U0923131A","SM2","SM2-RP","Single","EEE"]
[null,null,null,"XU YUNQING","U0923132J","SM3","SM2-AP/SM3","Single","ME"]
[null,null,null,"DAI SIYANG","U0923133F","SM3","SM2-AP/SM3","Single","EEE"]
[null,null,null,"WANG YIFAN","U0923134C","SM3","SM2-AP/SM3","Single","CBE"]
[null,null,null,"YAN JUN","U0923135L","SM3","SM2-AP/SM3","Single","EEE"]
[null,null,null,"CHEN YUNFENG","U0923136H","SM3","SM2-AP/SM3","Single","ENE"]
[null,null,null,"YIN KE","U0923138B","SM3","SM2-AP/SM3","Single","EEE"]
[null,null,null,"WANG DONG","U0923139K","SM3","SM2-AP/SM3","Single","EEE"]
[null,null,null,"ZHANG XIANG","U0923140B","SM3","SM2-AP/SM3","Single","EEE"]
[null,null,null,"HU HUI","U0923141K","SM2","SM2-RP","Single","EEE"]
[null,null,null,"WANG XIAO","U0923142G","SM2","SM2-RP","Single","EEE"]
[null,null,null,"LI SHIWEI","U0923143D","SM3","SM2-AP/SM3","Single","EEE"]
[null,null,null,"ZHAN TIANLONG","U0923144A","SM3","SM2-AP/SM3","Single","EEE"]
[null,null,null,"YANG WEI","U0923145J","SM3","SM2-AP/SM3","Double (Type 1)","BCG"]
[null,null,null,"SHEN JUNFEI","U0923146F","SM2","SM2-RP","Single","EEE"]
[null,null,null,"MA QINGLANG","U0923147C","SM2","SM2-RP","Single","MAT"]
[null,null,null,"DONG GUANQUN","U0923148L","SM3","SM2-AP/SM3","Single","EEE"]
[null,null,null,"GUAN WEIWEI","U0923149H","SM2","SM2-RP","Single","EEE"]
[null,null,null,"WANG WEIQIAN","U0923150L","SM2","SM2-RP","Single","EEE"]
[null,null,null,"TAN HAIWANG","U0923151H","SM3","SM2-AP/SM3","Single","EEE"]
[null,null,null,"WU HAOZHOU","U0923152E","SM3","SM2-AP/SM3","Single","EEE"]
[null,null,null,"LI ZHEYU","U0923153B","SM3","SM2-AP/SM3","Single","EEE"]
[null,null,null,"PAN YINGLONG","U0923154K","SM3","SM2-AP/SM3",{"$f":"VLOOKUP(I$1:I$5281,$A$37:$B$212,2,FALSE)","v":"Single"},"EEE"]
[null,null,null,"MA BOKUN","U0923155G","SM3","SM2-AP/SM3","Double (Type 1)","BCG"]
[null,null,null,"BAI YAGUANG","U0923156D","SM3","SM2-AP/SM3","Single","CBE"]
[null,null,null,"TANG SHUKONG","U0923157A","SM3","SM2-AP/SM3","Single","EEE"]
[null,null,null,"YANG QIN","U0923158J","SM2","SM2-RP","Single","ENE"]
[null,null,null,"ZHANG LIAOFAN","U0923159F","SM2 (Accelerated)","SM2-AP/SM3","Single","EEE"]
[null,null,null,"LI ANG","U0923160J","SM2","SM2-RP","Single","EEE"]
[null,null,null,"LIU XU","U0923161F","SM3","SM2-AP/SM3","Single","EEE"]
[null,null,null,"JIANG ZHELONG","U0923162C","SM2 (Accelerated)","SM2-AP/SM3","Single","MAT"]
[null,null,null,"ZHANG HUANCHAO","U0923163L","SM2","SM2-RP","Single","ME"]
[null,null,null,"ZHANG DONG","U0923164H","SM2","SM2-RP","Single","EEE"]
[null,null,null,"WANG ZHUO","U0923165E","SM2","SM2-RP","Single","EEE"]
[null,null,null,"XU YIJUN","U0923166B","SM2","SM2-RP","Single","ME"]
[null,null,null,"HUANG HANTAO","U0923167K","SM3","SM2-AP/SM3","Single","EEE"]
[null,null,null,"JIN ZIYU","U0923168G","SM2","SM2-RP","Single","MAT"]
[null,null,null,"YAN HAIPING","U0923169D","SM2","SM2-RP","Single","EEE"]
[null,null,null,"HUANG WEIBIAO","U0923170G","SM2","SM2-RP","Single","EEE"]
[null,null,null,"WEN MEIMEI","U0923171D","SM2","SM2-RP","Single","MAT"]
[null,null,null,"LUO CHUAN","U0923172A","SM2","SM2-RP","Single","EEE"]
[null,null,null,"REN HENGJIANG","U0923174F","SM2","SM2-RP","Single","EEE"]
[null,null,null,"SONG HAORAN","U0923175C","SM3","SM2-AP/SM3","Single","CBE"]
[null,null,null,"SONG HANFU","U0923176L","SM2","SM2-RP","Single","EEE"]
[null,null,null,"JU PENG","U0923177H","SM2","SM2-RP","Single","EEE"]
[null,null,null,"LI LUYING","U0923178E","SM2","SM2-RP","Single","EEE"]
[null,null,null,"WANG YU","U0923179B","SM2","SM2-RP","Single","MS"]
[null,null,null,"LI XIAOCHAO","U0923180E","SM2","SM2-RP","Single","EEE"]
[null,null,null,"LI XUEXIAN","U0923181B","SM2","SM2-RP","Single","CBE"]
[null,null,null,"YUAN ZHEN","U0923182K","SM2","SM2-RP","Single","ME"]
[null,null,null,"REN PEIPEI","U0923183G","SM3","SM2-AP/SM3","Single","EEE"]
[null,null,null,"CHEN PENG","U0923184D","SM2","SM2-RP","Single","CSC"]
[null,null,null,"LI JUNQIANG","U0923186J","SM2","SM2-RP","Single","EEE"]
[null,null,null,"LIU YING","U0923187F","SM2","SM2-RP","Single","EEE"]
[null,null,null,"YIN XIAOCHENG","U0923188C","SM2","SM2-RP","Single","CE"]
[null,null,null,"HU YUANWEI","U0923190C","SM3","SM2-AP/SM3","Single","EEE"]
[null,null,null,"DONG YE","U0923191L","SM3","SM2-AP/SM3","Single","EEE"]
[null,null,null,"GAO YI","U0923192H","SM3","SM2-AP/SM3","Single","CBE"]
[null,null,null,"SONG MENGLU","U0923193E","SM3","SM2-AP/SM3","Single","EEE"]
[null,null,null,"SHEN ZHEYUN","U0923194B","SM3","SM2-AP/SM3","Single","EEE"]
[null,null,null,"ZHAO HAN","U0923195K","SM3","SM2-AP/SM3","Single","MAT"]
[null,null,null,"LIN YE","U0923196G","SM3","SM2-AP/SM3","Single","EEE"]
[null,null,null,"DING WEI","U0923197D","SM3","SM2-AP/SM3","Single","EEE"]
[null,null,null,"CHENG ZIHAO","U0923198A","SM3","SM2-AP/SM3","Single","EEE"]
[null,null,null,"LI SANCAI","U0923199J","SM3","SM2-AP/SM3","Single","CE"]
[null,null,null,"FAN CHAO","U0923200A","SM3","SM2-AP/SM3","Single","EEE"]
[null,null,null,"GAI YI","U0923201J","SM3","SM2-AP/SM3","Single","MAT"]
[null,null,null,"LI ZHEN","U0923202F","SM3","SM2-AP/SM3","Double (Type 1)","BCG"]
[null,null,null,"LIU LIFEN","U0923203C","SM3","SM2-AP/SM3","Single","EEE"]
[null,null,null,"DU QUANCHENG","U0923204L","SM3","SM2-AP/SM3","Single","EEE"]
[null,null,null,"LU SHIQUAN","U0923205H","SM3","SM2-AP/SM3","Single","MAT"]
[null,null,null,"TANG LONG","U0923206E","SM3","SM2-AP/SM3","Single","EEE"]
[null,null,null,"ZHANG RUIYANG","U0923207B","SM2 (Accelerated)","SM2-AP/SM3","Single","EEE"]
[null,null,null,"BAO SHUYU","U0923208K","SM3","SM2-AP/SM3","Single","MAT"]
[null,null,null,"XIA XUERONG","U0923209G","SM3","SM2-AP/SM3","Single","MS"]
[null,null,null,"JIANG ZHUOQING","U0923210K","SM3","SM2-AP/SM3","Single","IEM"]
[null,null,null,"SHEN HUIZHI","U0923211G","SM3","SM2-AP/SM3","Single","IEM"]
[null,null,null,"CAI XIAOLEI","U0923212D","SM3","SM2-AP/SM3","Single","CBE"]
[null,null,null,"HAN WEI","U0923213A","SM3","SM2-AP/SM3","Single","EEE"]
[null,null,null,"MENG FANZENG","U0923214J","SM3","SM2-AP/SM3","Single","EEE"]
[null,null,null,"WANG CHENG","U0923215F","SM3","SM2-AP/SM3","Single","ENE"]
[null,null,null,"PAN TIANCHI","U0923216C","SM3","SM2-AP/SM3","Single","EEE"]
[null,null,null,"LIN ZHOU","U0923217L","SM3","SM2-AP/SM3","Single","EEE"]
[null,null,null,"XIANG LEI","U0923218H","SM3","SM2-AP/SM3","Single","CBE"]
[null,null,null,"WU YUREN","U0923220H","SM3","SM2-AP/SM3","Single","CE"]
[null,null,null,"LIU YUXIN","U0923221E","SM3","SM2-AP/SM3","Single","BIE"]
[null,null,null,"MEI LEI","U0923223K","SM3","SM2-AP/SM3",{"$f":"VLOOKUP(I$1:I$5281,$A$37:$B$212,2,FALSE)","v":"Single"},"EEE"]
[null,null,null,"WANG YANAN","U0923224G","SM3","SM2-AP/SM3","Single","EEE"]
[null,null,null,"WANG ZHAO","U0923225D","SM3","SM2-AP/SM3","Single","ME"]
[null,null,null,"CHEN CHAO","U0923226A","SM3","SM2-AP/SM3","Single","MAT"]
[null,null,null,"WANG NING","U0923227J","SM2","SM2-RP","Single","CE"]
[null,null,null,"XUE GUYU","U0923229C","SM3","SM2-AP/SM3","Double (Type 1)","BCG"]
[null,null,null,"WU JIAJUN","U0923230F","SM3","SM2-AP/SM3","Single","MATH"]
[null,null,null,"ZHOU YIYING","U0923231C","SM3","SM2-AP/SM3","Single","IEM"]
[null,null,null,"WANG QIUSHI","U0923232L","SM3","SM2-AP/SM3","Single","CE"]
[null,null,null,"WANG JIAN","U0923233H","SM3","SM2-AP/SM3","Single","MAT"]
[null,null,null,"LIU TONG","U0923234E","SM3","SM2-AP/SM3","Single","EEE"]
[null,null,null,"LI GUIFU","U0923235B","SM3","SM2-AP/SM3","Single","CSC"]
[null,null,null,"ZHAN JUN","U0923236K","SM3","SM2-AP/SM3","Single","EEE"]
[null,null,null,"XU YUANJIE","U0923237G","SM3","SM2-AP/SM3","Single","EEE"]
[null,null,null,"WANG CHENCHAO","U0923238D","SM2","SM2-RP","Single","EEE"]
[null,null,null,"ZHAO YINWU","U0923239A","SM3","SM2-AP/SM3","Single","EEE"]
[null,null,null,"LIU JING","U0923240D","SM3","SM2-AP/SM3","Single","EEE"]
[null,null,null,"LIU YUNING","U0923241A","SM2","SM2-RP","Single","IEM"]
[null,null,null,"FANG SHUWEI","U0923242J","SM3","SM2-AP/SM3","Single","CSC"]
[null,null,null,"LI LILI","U0923243F","SM3","SM2-AP/SM3","Single","CBE"]
[null,null,null,"LIN HUAN","U0923244C","SM3","SM2-AP/SM3","Single","CSC"]
[null,null,null,"SUN BING","U0923245L","SM3","SM2-AP/SM3","Single","EEE"]
[null,null,null,"YUAN SHANGQIN","U0923246H","SM3","SM2-AP/SM3","Single","MAT"]
[null,null,null,"QI WENJING","U0923248B","SM3","SM2-AP/SM3","Single","IEM"]
[null,null,null,"ZHANG LUWEI","U0923249K","SM3","SM2-AP/SM3","Single","EEE"]
[null,null,null,"LI NING","U0923250B","SM3","SM2-AP/SM3","Single","EEE"]
[null,null,null,"RAN WEI","U0923251K","SM3","SM2-AP/SM3","Single","CE"]
[null,null,null,"ZHANG LIPING","U0923252G","SM3","SM2-AP/SM3","Single","EEE"]
[null,null,null,"XING XIAOYANG","U0923253D","SM3","SM2-AP/SM3","Single","EEE"]
[null,null,null,"ZHANG XIAOXIAO","U0923254A","SM3","SM2-AP/SM3","Single","EEE"]
[null,null,null,"FU YAN","U0923255J","SM3","SM2-AP/SM3","Single","EEE"]
[null,null,null,"LI ZHUOLUN","U0923256F","SM3","SM2-AP/SM3","Single","EEE"]
[null,null,null,"YANG JIONG","U0923257C","SM3","SM2-AP/SM3","Single","EEE"]
[null,null,null,"XIAO BO","U0923258L","SM3","SM2-AP/SM3","Single","EEE"]
[null,null,null,"SUN CHENGYU","U0923259H","SM3","SM2-AP/SM3","Single","EEE"]
[null,null,null,"FAN HAO","U0923260L","SM3","SM2-AP/SM3","Single","MAT"]
[null,null,null,"FU ANQI","U0923261H","SM2","SM2-RP","Single","CE"]
[null,null,null,"LIU XUEDONG","U0923262E","SM3","SM3","Single","EEE"]
[null,null,null,"CAO QI","U0923263B","SM3","SM2-AP/SM3","Single","EEE"]
[null,null,null,"DU QIANRU","U0923264K","SM2","SM2-RP","Single","CBE"]
[null,null,null,"LIU XIAO","U0923265G","SM2","SM2-RP","Single","ENE"]
[null,null,null,"HAN CHENJIANG","U0923266D","SM2","SM2-RP","Single","EEE"]
[null,null,null,"ZHU DI","U0923267A","SM2","SM2-RP","Single","EEE"]
[null,null,null,"WEI MENGYAO","U0923268J","SM2","SM2-RP","Single","MAT"]
[null,null,null,"SHI DAMING","U0923269F","SM2","SM2-RP","Single","CBE"]
[null,null,null,"DING ZEYU","U0923270J","SM2","SM2-RP","Single","EEE"]
[null,null,null,"LIU LINKUN","U0923271F","SM2","SM2-RP","Single","EEE"]
[null,null,null,"GENG YIHANG","U0923272C","SM2","SM2-RP","Single","ME"]
[null,null,null,"YU HAOHONG","U0923273L","SM2","SM2-RP","Single","EEE"]
[null,null,null,"SUN JING","U0923274H","SM2","SM2-RP","Single","EEE"]
[null,null,null,"GUO KANG","U0923276B","SM3","SM2-AP/SM3","Single","EEE"]
[null,null,null,"NIE BINYAN","U0923277K","SM2","SM2-RP","Single","EEE"]
[null,null,null,"LI YIWEN","U0923278G","SM2","SM2-RP","Single","MAT"]
[null,null,null,"SUN CHUNYANG","U0923279D","SM2","SM2-RP","Single","ME"]
[null,null,null,"YANG CHENLU","U0923281D","SM3","SM2-AP/SM3","Single","MAT"]
[null,null,null,"LI QILIN","U0923282A","SM2","SM2-RP","Single","EEE"]
[null,null,null,"LIU YUAN","U0923285C","SM2","SM2-RP","Single","EEE"]
[null,null,null,"ZHOU YAOHUI","U0923286L","SM2","SM2-RP","Single","CEE"]
[null,null,null,"WANG JINGYAN","U0923287H","SM3","SM2-AP/SM3","Single","CSC"]
[null,null,null,"GAO YAN","U0923288E","SM2","SM2-RP","Single","EEE"]
[null,null,null,"HUAN YIQUN","U0923289B","SM2","SM2-RP","Single","EEE"]
[null,null,null,"ZUO MENG","U0923290E","SM2","SM2-RP","Single","CBE"]
[null,null,null,"YIN BANGQI","U0923291B","SM2","SM2-RP","Single","EEE"]
[null,null,null,"QING XIANGYUE","U0923292K","SM3","SM2-AP/SM3","Single","EEE"]
[null,null,null,"ZHAO YUE","U0923294D","SM2","SM2-RP",{"$f":"VLOOKUP(I$1:I$5281,$A$37:$B$212,2,FALSE)","v":"Single"},"EEE"]
[null,null,null,"CHEN JIEYU","U0923295A","SM3","SM2-AP/SM3","Single","EEE"]
[null,null,null,"JIANG DAN","U0923296J","SM2","SM2-RP","Single","EEE"]
[null,null,null,"MA TAICHONG","U0923297F","SM3","SM2-AP/SM3","Single","MAT"]
[null,null,null,"LI NONG","U0923298C","SM3","SM2-AP/SM3","Single","EEE"]
[null,null,null,"GU XINCHI","U0923299L","SM3","SM2-AP/SM3","Single","CSC"]
[null,null,null,"WANG XIYAN","U0923300C","SM3","SM2-AP/SM3","Single","EEE"]
[null,null,null,"SHI YI","U0923301L","SM3","SM2-AP/SM3","Single","MS"]
[null,null,null,"PU SHUYI","U0923302H","SM3","SM2-AP/SM3","Single","MS"]
[null,null,null,"PANG ZINENG","U0923304B","SM2","SM2-RP","Single","CSC"]
[null,null,null,"LI YINGHE","U0923305K","SM2","SM2-RP","Single","EEE"]
[null,null,null,"KOU ZHIGANG","U0923306G","SM3","SM2-AP/SM3","Single","IEM"]
[null,null,null,"WANG LUO","U0923308A","SM3","SM2-AP/SM3","Single","EEE"]
[null,null,null,"HUANG PENGYUAN","U0923311J","SM2","SM2-RP","Single","ME"]
[null,null,null,"ZHANG ZONGYANG","U0923312F","SM2","SM2-RP","Single","EEE"]
[null,null,null,"FENG JING","U0923315H","SM2","SM2-RP","Single","CEE"]
[null,null,null,"ZHOU YANG","U0923316E","SM3","SM2-AP/SM3","Single","MAT"]
[null,null,null,"LIU SHANSHAN","U0923318K","SM3","SM2-AP/SM3","Single","EEE"]
[null,null,null,"ZOU YINGYING","U0923321G","SM3","SM2-AP/SM3","Single","EEE"]
[null,null,null,"LI XILU","U0923322D","SM3","SM2-AP/SM3","Single","ME"]
[null,null,null,"ZHENG MENGYING","U0923324J","SM3","SM2-AP/SM3","Single","EEE"]
[null,null,null,"MICHIKO MULIA","U0940061C","Sembcorp","No bridging","Single","MAEC"]
[null,null,null,"IGNATIA CINDY GUNAWAN","U0940063H","Sembcorp","No bridging","Single","MATH"]
[null,null,null,"ANDRI PRADANA","U0940082G","Sembcorp","No bridging","Single","PHY"]
[null,null,null,"KEZIA GUSMAWAN","U0940084A","Sembcorp","No bridging","Single","CHEM"]
[null,null,null,"ZHANG RUIKE","U0940228E","MOE PreU Scholar (PRC)","No bridging","Single","MAEC"]
[null,null,null,"WANG YE","U0940793E","MOE PreU Scholar (PRC)","No bridging","Single","MAEC"]
[null,null,null,"ZHOU QIN","U0941051H","SM2","SM2-RP","Single","MAEC"]
[null,null,null,"QI LE","U0941052E","SM2 (Accelerated)","SM2-AP/SM3","Single","BS"]
[null,null,null,"XING FANG","U0941053B","SM2","SM2-RP","Single","MATH"]
[null,null,null,"WANG JIAQIAN","U0941054K","SM2","SM2-RP","Single","MATH"]
[null,null,null,"SU ZELIN","U0941055G","SM3","SM2-AP/SM3","Single","MAEC"]
[null,null,null,"ZHANG YICHI","U0941056D","SM2","SM2-RP","Single","MATH"]
[null,null,null,"ZHANG JIANHUAN","U0941057A","SM2","SM2-RP","Single","MAEC"]
[null,null,null,"HOU XIAOLU","U0941058J","SM2","SM2-RP","Single","MATH"]
[null,null,null,"WANG YISHI","U0941059F","SM2","SM2-RP","Single","MAEC"]
[null,null,null,"HU ZHONGCHEN","U0941060J","SM2","SM2-RP","Single","MAEC"]
[null,null,null,"WANG RUI","U0941061F","SM2","SM2-RP","Single","CHEM"]
[null,null,null,"ZHANG PEIPEI","U0941062C","SM2","SM2-RP","Single","MATH"]
[null,null,null,"WANG ZHIYUE","U0941063L","SM2","SM2-RP","Single","CHEM"]
[null,null,null,"YU JIE","U0941065E","SM2","SM2-RP","Single","MATH"]
[null,null,null,"CHAN WEIWEI","U0941066B","SM2","SM2-RP","Single","PHY"]
[null,null,null,"YU YIQING","U0941067K","SM2","SM2-RP","Single","MAEC"]
[null,null,null,"XU QIONG","U0941068G","SM2","SM2-RP","Single","MAEC"]
[null,null,null,"ZHAO TIANJIAO","U0941069D","SM2","SM2-RP","Single","MAEC"]
[null,null,null,"CHEN HONGYU","U0941070G","SM2 (Accelerated)","SM2-AP/SM3","Single","MAEC"]
[null,null,null,"YANG SIQIANG","U0941071D","SM2 (Accelerated)","SM2-AP/SM3","Single","MAEC"]
[null,null,null,"XU YANG","U0941072A","SM2","SM2-RP","Single","MAEC"]
[null,null,null,"TANG QUAN","U0941073J","SM3","SM2-AP/SM3","Single","BS"]
[null,null,null,"ZHANG DONGXU","U0941074F","SM3","SM2-AP/SM3","Single","MAEC"]
[null,null,null,"LONG CHONG","U0941075C","SM3","SM2-AP/SM3","Single","CHEM"]
[null,null,null,"WANG YAN","U0941076L","SM3","SM2-AP/SM3","Single","MAEC"]
[null,null,null,"JIANG SHURAN","U0941077H","SM2 (Accelerated)","SM2-AP/SM3","Single","PHY"]
[null,null,null,"LI QIANLI","U0941078E","SM3","SM2-AP/SM3","Single","MAEC"]
[null,null,null,"ZHANG SHAOYU","U0941079B","SM3","SM2-AP/SM3","Single","MAEC"]
[null,null,null,"HAN CONG","U0941080E","SM3","SM2-AP/SM3","Single","MAEC"]
[null,null,null,"JIN LULU","U0941081B","SM2","SM2-RP","Single","MAEC"]
[null,null,null,"LIU YUEMING","U0941083G","SM2","SM2-RP","Single","MATH"]
[null,null,null,"SHI LEI","U0941084D","SM3","SM2-AP/SM3","Single","MATH"]
[null,null,null,"LIANG RUI","U0941085A","SM3","SM2-AP/SM3","Single","CHEM"]
[null,null,null,"LI KUOHAN","U0941086J","SM2","SM2-RP","Single","BS"]
[null,null,null,"YANG YIMENG","U0941087F","SM2","SM2-RP","Single","MAEC"]
[null,null,null,"YANG ENDONG","U0941088C","SM2","SM2-RP","Single","MATH"]
[null,null,null,"ZHANG TINGTING","U0941089L","SM2","SM2-RP","Single","MATH"]
[null,null,null,"ZENG DEHUA","U0941090C","SM2","SM2-RP",{"$f":"VLOOKUP(I$1:I$5281,$A$37:$B$212,2,FALSE)","v":"Single"},"MATH"]
[null,null,null,"DING YICHEN","U0941091L","SM3","SM2-AP/SM3","Single","BS"]
[null,null,null,"SONG ZHIBO","U0941092H","SM3","SM2-AP/SM3","Single","PHY"]
[null,null,null,"LIU SHIYANG","U0941093E","SM3","SM2-AP/SM3","Single","BS"]
[null,null,null,"WANG SIJIA","U0941094B","SM3","SM2-AP/SM3","Single","MAEC"]
[null,null,null,"DONG JINGHUA","U0941095K","SM3","SM2-AP/SM3","Single","CHEM"]
[null,null,null,"ZHANG ZHIHUI","U0941096G","SM3","SM2-AP/SM3","Single","MAEC"]
[null,null,null,"YU JIADONG","U0941097D","SM3","SM2-AP/SM3","Single","MATH"]
[null,null,null,"DAI XINYI","U0941098A","SM3","SM2-AP/SM3","Single","MAEC"]
[null,null,null,"LIU ZHENG","U0941099J","SM3","SM2-AP/SM3","Single","CHEM"]
[null,null,null,"ZHU LIYE","U0941100A","SM3","SM2-AP/SM3","Single","MATH"]
[null,null,null,"LU WUYIN","U0941101J","SM3","SM2-AP/SM3","Single","PHY"]
[null,null,null,"CHEN DAN","U0941103C","SM3","SM2-AP/SM3","Single","MAEC"]
[null,null,null,"YAN XIA","U0941105H","SM3","SM2-AP/SM3","Single","CHEM"]
[null,null,null,"LI SITE","U0941106E","SM2","SM2-RP","Single","MATH"]
[null,null,null,"XIE SHIHAN","U0941107B","SM2 (Accelerated)","SM2-AP/SM3","Single","MAEC"]
[null,null,null,"ZHANG QI","U0941108K","SM2","SM2-RP","Single","MATH"]
[null,null,null,"JU YINJUAN","U0941109G","SM2","SM2-RP","Single","BS"]
[null,null,null,"LIN FEIFEI","U0941110K","SM2 (Accelerated)","SM2-AP/SM3","Single","MAEC"]
[null,null,null,"CAI XIAOYI","U0941112D","SM3","SM2-AP/SM3","Single","PHY"]
[null,null,null,"ZHANG ZHONGKANG","U0941113A","SM2","SM2-RP","Single","PHY"]
[null,null,null,"QIU JINGLAN","U0941114J","SM3","SM2-AP/SM3","Single","MATH"]
[null,null,null,"PODIANKO SURYA","U1020136H","Direct","No bridging","Single","CEE"]
[null,null,null,"GABRIEL ALEXANDER","U1020137E","Direct","No bridging","Single","CBE"]
[null,null,null,"YONAS STEPHEN SUHARTONO","U1020141K","Direct","No bridging","Single","CSC"]
[null,null,null,"KARINA KURNIAWAN","U1020148L","Direct","No bridging","Single","CHEM"]
[null,null,null,"AGUNG PURNOMO SENDY","U1020162C","Direct","No bridging","Single","MAT"]
[null,null,null,"GRANDY PARAMANANDA PUTRA","U1020170G","Direct","No bridging","Single","MAT"]
[null,null,null,"SEBASTIAN KEVIN SUGIARTO","U1020171D","Direct","No bridging","Single","MAT"]
[null,null,null,"RAMON MITRA","U1020183G","Direct","No bridging","Single","ME"]
[null,null,null,"MELVIN","U1020184D","Direct","No bridging","Single","MAT"]
[null,null,null,"ARWIN PRATOMO","U1020185A","Direct","No bridging","Single","ME"]
[null,null,null,"DIEGO ALPIN","U1020192H","Direct","No bridging","Single","MAT"]
[null,null,null,"STEPHANI PUSPITA KURNIAWAN","U1020193E","Direct","No bridging","Single","CSC"]
[null,null,null,"CHELSEA LINDRASARI JONATHAN","U1020212D","Direct","No bridging","Single","CBE"]
[null,null,null,"GERRY ANGGACIPTA","U1020222B","Direct","No bridging","Single","CSC"]
[null,null,null,"RADITYA YUDHA PRAWIRA","U1020242J","Direct","No bridging","Single","ME"]
[null,null,null,"SURYA RACHMAD PANGESTU","U1020254A","Direct","No bridging","Single","MAT"]
[null,null,null,"ROBIN","U1020285C","Direct","No bridging","Single","CSC"]
[null,null,null,"SRIDHARAN VIGNESH","U1020571A","Direct","No bridging","Single","EEE"]
[null,null,null,"ARNAV KUMAR","U1020584A","Direct","No bridging","Single","CSC"]
[null,null,null,"BHAR RADHIKA","U1020587C","Direct","No bridging","Single","EEE"]
[null,null,null,"MINOCHA RIDDHIMA","U1020589H","Direct","No bridging","Single","BIE"]
[null,null,null,"VISWANATHUNI SRUTHI","U1020603L","Direct","No bridging","Single","CE"]
[null,null,null,"NILOTPAL JHA","U1020665D","Direct","No bridging","Single","EEE"]
[null,null,null,"SRIVASTAVA SARTHAK","U1020735A","SIA Youth","No bridging","Single","AERO"]
[null,null,null,"CHEN KAI","U1020745K","MOE PreU Scholar (PRC)","No bridging","Single","ENE"]
[null,null,null,"ATIF SALEEM","U1020748A","Direct","No bridging","Double (Type 1)","BCG"]
[null,null,null,"XU YINGCHUN","U1020845A","MOE PreU Scholar (PRC)","No bridging","Double (Type 1)","BCG"]
[null,null,null,"AGARWAL SONAL","U1021144D","Direct","No bridging","Single","EEE"]
[null,null,null,"ANUBHA GUPTA","U1021163C","Direct","No bridging","Single","CE"]
[null,null,null,"GARODIA ANSHU","U1021355C","Direct","No bridging","Double (Type 1)","BCG"]
[null,null,null,"FENG LIN","U1021550L","MOE PreU Scholar (PRC)","No bridging","Double (Type 1)","BCG"]
[null,null,null,"KHANNA VRINDA","U1021553B","Direct","No bridging","Single","CE"]
[null,null,null,"MA BIAO","U1021631C","MOE PreU Scholar (PRC)","No bridging","Single","EEE"]
[null,null,null,"SUBRAMANIAN JAYASHREE","U1021666D","Direct","No bridging","Single","EEE"]
[null,null,null,"HOU ZHENG","U1021752J","MOE PreU Scholar (PRC)","No bridging","Single","CBE"]
[null,null,null,"AKHAND PRATAP SINGH","U1022201D","Direct","No bridging","Double (Type 1)","BCG"]
[null,null,null,"KRISHNAN ANANTH","U1022221L","Direct","No bridging","Single","EEE"]
[null,null,null,"RUHELA CHIRAG","U1022297A","Direct","No bridging","Single","CSC"]
[null,null,null,"MITTAL ROHIT","U1022350K","Direct","No bridging","Single","CE"]
[null,null,null,"DAMERACHARLA PRITHVI RAJ","U1022388B","Direct","No bridging","Single","EEE"]
[null,null,null,"PARASAR AMBARISH","U1022498B","Direct","No bridging","Single","ME"]
[null,null,null,"LIU ZELAI","U1022676E","MOE PreU Scholar (PRC)","No bridging","Single","MS"]
[null,null,null,"LI QIAN","U1022738J","SM2","SM2-RP",{"$f":"VLOOKUP(I$1:I$5281,$A$37:$B$212,2,FALSE)","v":"Single"},"EEE"]
[null,null,null,"E JIAHUA","U1022739F","SM3","SM2-AP/SM3","Single","ME"]
[null,null,null,"YI LUDI","U1022740J","SM3","SM2-AP/SM3","Single","EEE"]
[null,null,null,"LIU YAYUAN","U1022741F","SM2 (Accelerated)","SM2-AP/SM3","Single","MAT"]
[null,null,null,"HUANG YIGE","U1022742C","SM3","SM2-AP/SM3","Single","PHY"]
[null,null,null,"JING YICHENG","U1022743L","SM2","SM2-RP","Single","ME"]
[null,null,null,"JI ZHUOYING","U1022744H","SM2","SM2-RP","Single","MS"]
[null,null,null,"CHEN LIANGQUAN","U1022745E","SM3","SM2-AP/SM3","Single","EEE"]
[null,null,null,"ZHANG JUN","U1022746B","SM3","SM2-AP/SM3","Single","CSC"]
[null,null,null,"ZHAO XIAOXU","U1022747K","SM3","SM2-AP/SM3","Single","MAT"]
[null,null,null,"HUANG JING","U1022748G","SM3","SM2-AP/SM3","Single","EEE"]
[null,null,null,"JIA ZHUNAN","U1022749D","SM3","SM2-AP/SM3","Single","MAT"]
[null,null,null,"LAN TIAN","U1022750G","SM3","SM2-AP/SM3","Single","MS"]
[null,null,null,"ZHANG HAOCHUAN","U1022751D","SM3","SM2-AP/SM3","Single","EEE"]
[null,null,null,"GE PENG","U1022752A","SM3","SM2-AP/SM3","Single","EEE"]
[null,null,null,"LIU XUZHAO","U1022753J","SM3","SM2-AP/SM3","Single","MAT"]
[null,null,null,"LIU XI","U1022754F","SM2","SM2-RP","Single","EEE"]
[null,null,null,"ZHOU HAO","U1022755C","SM3","SM2-AP/SM3","Single","EEE"]
[null,null,null,"WANG SHENGMIAO","U1022756L","SM3","SM2-AP/SM3","Single","EEE"]
[null,null,null,"GENG LI","U1022757H","SM2 (Accelerated)","SM2-AP/SM3","Single","CBE"]
[null,null,null,"ZHANG SHUHAO","U1022758E","SM3","SM2-AP/SM3","Single","CE"]
[null,null,null,"LU MENGTIAN","U1022759B","SM3","SM2-AP/SM3","Single","EEE"]
[null,null,null,"YAN AN","U1022760E","SM2 (Accelerated)","SM2-AP/SM3","Double (Type 1)","BCG"]
[null,null,null,"FU SHIMO","U1022761B","SM2 (Accelerated)","SM2-AP/SM3","Single","MS"]
[null,null,null,"LAN XIN","U1022762K","SM3","SM2-AP/SM3","Single","CE"]
[null,null,null,"ZHANG TONGYUAN","U1022763G","SM3","SM2-AP/SM3","Single","EEE"]
[null,null,null,"SU CHENGXUN","U1022764D","SM2","SM2-RP","Single","BIE"]
[null,null,null,"LI YINGKUI","U1022765A","SM3","SM2-AP/SM3","Single","EEE"]
[null,null,null,"WANG JINYU","U1022766J","SM3","SM2-AP/SM3","Single","MS"]
[null,null,null,"ZENG XINYI","U1022767F","SM2","SM2-RP","Single","EEE"]
[null,null,null,"ZHONG YAOYING","U1022769L","SM3","SM2-AP/SM3","Single","MAT"]
[null,null,null,"ZHOU ZHICAI","U1022770C","SM3","SM2-AP/SM3","Single","BIE"]
[null,null,null,"WU TIANJIAO","U1022771L","SM3","SM2-AP/SM3","Single","MAT"]
[null,null,null,"CHU WEIMIN","U1022772H","SM3","SM2-AP/SM3","Single","CSC"]
[null,null,null,"XIA YANG","U1022773E","SM3","SM2-AP/SM3","Single","MAT"]
[null,null,null,"LI XIJUN","U1022774B","SM2","SM2-RP","Single","EEE"]
[null,null,null,"WANG XUEQIN","U1022775K","SM3","SM2-AP/SM3","Single","MS"]
[null,null,null,"SUN HAO","U1022776G","SM3","SM2-AP/SM3","Single","ME"]
[null,null,null,"CHEN XUETING","U1022777D","SM3","SM2-AP/SM3","Single","EEE"]
[null,null,null,"HU WENMIAO","U1022778A","SM3","SM2-AP/SM3","Single","EEE"]
[null,null,null,"WANG SHENGXIAO","U1022779J","SM2","SM2-RP","Single","EEE"]
[null,null,null,"WANG KAI","U1022780A","SM2","SM2-RP","Single","EEE"]
[null,null,null,"ZOU PEIJUN","U1022781J","SM3","SM2-AP/SM3","Double (Type 1)","BCG"]
[null,null,null,"TONG SIYUAN","U1022782F","SM2","SM2-RP","Single","EEE"]
[null,null,null,"LI JIANSHU","U1022785H","SM3","SM2-AP/SM3","Single","EEE"]
[null,null,null,"LEI PU","U1022786E","SM2","SM2-RP","Single","ME"]
[null,null,null,"WANG XIAOGANG","U1022787B","SM3","SM2-AP/SM3","Single","EEE"]
[null,null,null,"ZHANG ZHIDONG","U1022788K","SM2","SM2-RP","Single","EEE"]
[null,null,null,"HE HUILING","U1022789G","SM2 (Accelerated)","SM2-AP/SM3","Single","BIE"]
[null,null,null,"YUAN MENGYI","U1022790K","SM2","SM2-RP","Single","EEE"]
[null,null,null,"TAN JIALIANG","U1022791G","SM3","SM2-AP/SM3","Single","EEE"]
[null,null,null,"WU XIAOXUAN","U1022792D","SM2","SM2-RP","Single","EEE"]
[null,null,null,"LI YUANLI","U1022793A","SM3","SM2-AP/SM3","Single","EEE"]
[null,null,null,"ZENG LEIYANG","U1022794J","SM3","SM2-AP/SM3","Single","BIE"]
[null,null,null,"LIU JIAJUN","U1022795F","SM3","SM2-AP/SM3","Single","ME"]
[null,null,null,"LI DONGKAI","U1022796C","SM3","SM2-AP/SM3","Single","EEE"]
[null,null,null,"YAN YIHAN","U1022797L","SM3","SM2-AP/SM3","Single","MAT"]
[null,null,null,"XIN YASAI","U1022799E","SM2","SM2-RP","Single","EEE"]
[null,null,null,"WANG JINGFENG","U1022800H","SM3","SM2-AP/SM3","Single","EEE"]
[null,null,null,"LIU TIANJIA","U1022801E","SM3","SM2-AP/SM3","Single","ME"]
[null,null,null,"LONG JIRU","U1022803K","SM3","SM2-AP/SM3","Single","EEE"]
[null,null,null,"ZHU ZIMING","U1022804G","SM3","SM2-AP/SM3","Single","MATH"]
[null,null,null,"TAN XIAO","U1022806A","SM3","SM2-AP/SM3","Single","MAT"]
[null,null,null,"ZHOU BO","U1022807J","SM3","SM2-AP/SM3","Single","EEE"]
[null,null,null,"GU XINYUE","U1022808F","SM3","SM2-AP/SM3",{"$f":"VLOOKUP(I$1:I$5281,$A$37:$B$212,2,FALSE)","v":"Single"},"EEE"]
[null,null,null,"YU YANG","U1022809C","SM3","SM2-AP/SM3","Single","ME"]
[null,null,null,"GUI SHENGYU","U1022810F","SM3","SM2-AP/SM3","Single","EEE"]
[null,null,null,"ZHONG AI","U1022811C","SM3","SM2-AP/SM3","Single","CEE"]
[null,null,null,"YU SIJIA","U1022812L","SM3","SM2-AP/SM3","Single","MAT"]
[null,null,null,"YANG LING","U1022813H","SM3","SM2-AP/SM3","Single","MAT"]
[null,null,null,"LI XIANG","U1022814E","SM2","SM2-RP","Single","CEE"]
[null,null,null,"HU YAWEI","U1022815B","SM3","SM2-AP/SM3","Single","CSC"]
[null,null,null,"LI LONGTAI","U1022816K","SM3","SM2-AP/SM3","Single","EEE"]
[null,null,null,"HUANG LE","U1022817G","SM3","SM2-AP/SM3","Single","EEE"]
[null,null,null,"LIU TONG","U1022818D","SM2","SM2-RP","Single","IEM"]
[null,null,null,"SUN ZITONG","U1022819A","SM2","SM2-RP","Single","EEE"]
[null,null,null,"XU MENG","U1022820D","SM2 (Accelerated)","SM2-AP/SM3","Double (Type 1)","BCG"]
[null,null,null,"DU YUJIA","U1022821A","SM2","SM2-RP","Single","MAEC"]
[null,null,null,"ZUO WANGSHU","U1022822J","SM2","SM2-RP","Single","EEE"]
[null,null,null,"LIU WEI","U1022823F","SM3","SM2-AP/SM3","Single","EEE"]
[null,null,null,"FAN ZHOU","U1022824C","SM3","SM2-AP/SM3","Single","MAEC"]
[null,null,null,"ZHANG XIN","U1022825L","SM3","SM2-AP/SM3","Single","EEE"]
[null,null,null,"LIN DEKUN","U1022826H","SM3","SM2-AP/SM3","Single","IEM"]
[null,null,null,"YU JIANSHU","U1022827E","SM3","SM2-AP/SM3","Single","EEE"]
[null,null,null,"CHEN LUE","U1022828B","SM3","SM2-AP/SM3","Single","EEE"]
[null,null,null,"FAN YUQI","U1022829K","SM2","SM2-RP","Single","EEE"]
[null,null,null,"ZHANG KAIXI","U1022830B","SM3","SM2-AP/SM3","Single","CBE"]
[null,null,null,"LI HAO","U1022831K","SM3","SM2-AP/SM3","Single","EEE"]
[null,null,null,"YANG XING","U1022832G","SM3","SM2-AP/SM3","Single","EEE"]
[null,null,null,"MA SAI","U1022833D","SM2","SM2-RP","Single","EEE"]
[null,null,null,"ZHANG DONG","U1022834A","SM3","SM2-AP/SM3","Single","CE"]
[null,null,null,"WU XIN","U1022835J","SM2","SM2-RP","Single","CBE"]
[null,null,null,"QIAN JUN","U1022836F","SM3","SM2-AP/SM3","Single","EEE"]
[null,null,null,"SHI XIAOFENG","U1022837C","SM3","SM2-AP/SM3","Single","MAT"]
[null,null,null,"SUN KANQIANG","U1022838L","SM3","SM2-AP/SM3","Double (Type 1)","BCG"]
[null,null,null,"CHEN YUE","U1022839H","SM3","SM2-AP/SM3","Single","EEE"]
[null,null,null,"WANG JINGYUAN","U1022840L","SM3","SM2-AP/SM3","Single","IEM"]
[null,null,null,"GUO AIWEI","U1022841H","SM2","SM2-RP","Single","EEE"]
[null,null,null,"WANG FANGZHOU","U1022842E","SM2","SM2-RP","Single","CSC"]
[null,null,null,"FANG YUAN","U1022843B","SM2 (Accelerated)","SM2-AP/SM3","Single","CBE"]
[null,null,null,"JI ZHE","U1022844K","SM3","SM2-AP/SM3","Single","MAEC"]
[null,null,null,"ZHANG QIYU","U1022845G","SM3","SM2-AP/SM3","Single","EEE"]
[null,null,null,"SHAO XINYI","U1022846D","SM3","SM2-AP/SM3","Single","EEE"]
[null,null,null,"YU JIAN","U1022847A","SM3","SM2-AP/SM3","Single","EEE"]
[null,null,null,"SUN ZE","U1022848J","SM3","SM2-AP/SM3","Single","EEE"]
[null,null,null,"KONG LINGSHAN","U1022849F","SM3","SM2-AP/SM3","Single","EEE"]
[null,null,null,"QIN WEIGE","U1022850J","SM3","SM2-AP/SM3","Single","ME"]
[null,null,null,"WEI QIANJUN","U1022851F","SM3","SM2-AP/SM3","Single","EEE"]
[null,null,null,"YANG JUNTAO","U1022852C","SM2","SM2-RP","Single","ME"]
[null,null,null,"HE YUYUE","U1022853L","SM2","SM2-RP","Single","EEE"]
[null,null,null,"LIN YIDI","U1022854H","SM2","SM2-RP","Single","EEE"]
[null,null,null,"SHANG GUANYUE","U1022855E","SM2","SM2-RP","Single","CBE"]
[null,null,null,"ZHU SHIJIA","U1022856B","SM3","SM2-AP/SM3","Single","EEE"]
[null,null,null,"FU LEMENG","U1022857K","SM3","SM2-AP/SM3","Single","EEE"]
[null,null,null,"SUN HUAXI","U1022858G","SM2","SM2-RP","Single","EEE"]
[null,null,null,"XUE RUI","U1022859D","SM3","SM2-AP/SM3","Single","CBE"]
[null,null,null,"GONG YUANYUAN","U1022860G","SM2","SM2-RP","Single","CBE"]
[null,null,null,"CHEN CHUNYANG","U1022861D","SM2","SM2-RP","Single","ME"]
[null,null,null,"WU PEIZHE","U1022862A","SM3","SM2-AP/SM3","Single","MS"]
[null,null,null,"CHEN YOUCHEN","U1022863J","SM2","SM2-RP","Single","IEM"]
[null,null,null,"GU XUEQI","U1022864F","SM3","SM2-AP/SM3","Single","MS"]
[null,null,null,"WANG LING","U1022865C","SM3","SM2-AP/SM3","Single","MAEC"]
[null,null,null,"CHEN YAN","U1022866L","SM2","SM2-RP","Single","MAT"]
[null,null,null,"ZHOU WEI","U1022867H","SM3","SM2-AP/SM3","Single","MS"]
[null,null,null,"MAO YUYUAN","U1022868E","SM3","SM2-AP/SM3","Single","CEE"]
[null,null,null,"GOU QIAO","U1022869B","SM2","SM2-RP","Single","EEE"]
[null,null,null,"YANG YU","U1022870E","SM2","SM2-RP","Single","EEE"]
[null,null,null,"WANG JIAJUN","U1022871B","SM3","SM2-AP/SM3","Single","EEE"]
[null,null,null,"WU HAIQIANG","U1022872K","SM3","SM2-AP/SM3",{"$f":"VLOOKUP(I$1:I$5281,$A$37:$B$212,2,FALSE)","v":"Single"},"EEE"]
[null,null,null,"HUANG JIACHONG","U1022873G","SM2","SM2-RP","Single","EEE"]
[null,null,null,"LIU DONGNING","U1022874D","SM2","SM2-RP","Single","EEE"]
[null,null,null,"JIANG HAO","U1022876J","SM3","SM2-AP/SM3","Single","EEE"]
[null,null,null,"WU JIANGLU","U1022877F","SM2","SM2-RP","Single","EEE"]
[null,null,null,"YE JING","U1022878C","SM2","SM2-RP","Single","EEE"]
[null,null,null,"ZHAO XIAOQING","U1022879L","SM3","SM2-AP/SM3","Single","EEE"]
[null,null,null,"MA TIANYANG","U1022880C","SM2","SM2-RP","Single","EEE"]
[null,null,null,"LUO JIANLIN","U1022881L","SM3","SM2-AP/SM3","Single","CSC"]
[null,null,null,"SU DONGDONG","U1022884B","SM3","SM2-AP/SM3","Single","ME"]
[null,null,null,"GAO YUMENG","U1022885K","SM3","SM2-AP/SM3","Single","EEE"]
[null,null,null,"TIAN SHIYU","U1022886G","SM3","SM2-AP/SM3","Single","MAT"]
[null,null,null,"CHEN NANYAN","U1022887D","SM3","SM2-AP/SM3","Single","EEE"]
[null,null,null,"SU QIA","U1022888A","SM2","SM2-RP","Single","MS"]
[null,null,null,"PENG DANDAN","U1022889J","SM3","SM2-AP/SM3","Single","EEE"]
[null,null,null,"CUI YAN","U1022890A","SM3","SM2-AP/SM3","Single","CSC"]
[null,null,null,"LUO JIAQI","U1022891J","SM3","SM2-AP/SM3","Single","EEE"]
[null,null,null,"HU CHAORAN","U1022892F","SM3","SM2-AP/SM3","Single","EEE"]
[null,null,null,"TIAN JIAXING","U1022893C","SM2","SM2-RP","Single","CBE"]
[null,null,null,"LIU YIPING","U1022894L","SM2","SM2-RP","Single","EEE"]
[null,null,null,"MA ZUNJING","U1022895H","SM2","SM2-RP","Single","EEE"]
[null,null,null,"CHEN ZHAOYU","U1022896E","SM2","SM2-RP","Single","MAT"]
[null,null,null,"LIU JIAQI","U1022897B","SM2","SM2-RP","Single","EEE"]
[null,null,null,"WEI LAI","U1022898K","SM2","SM2-RP","Single","EEE"]
[null,null,null,"LIU YING","U1022899G","SM2","SM2-RP","Single","EEE"]
[null,null,null,"ZHANG YUJING","U1022900K","SM2","SM2-RP","Single","EEE"]
[null,null,null,"CHEN PULUO","U1022901G","SM2","SM2-RP","Single","ENE"]
[null,null,null,"MENG HUASONG","U1022902D","SM2","SM2-RP","Single","CSC"]
[null,null,null,"XU MING","U1022903A","SM3","SM2-AP/SM3","Single","EEE"]
[null,null,null,"ZHU LIYING","U1022904J","SM2","SM2-RP","Single","CEE"]
[null,null,null,"SHEN HUILI","U1022905F","SM3","SM2-AP/SM3","Single","ME"]
[null,null,null,"JIA MENG","U1022906C","SM2","SM2-RP","Single","EEE"]
[null,null,null,"LIU SONG","U1022907L","SM3","SM2-AP/SM3","Single","CSC"]
[null,null,null,"GUO HENG","U1022908H","SM3","SM2-AP/SM3","Single","EEE"]
[null,null,null,"QIN GEMENG","U1022909E","SM2","SM2-RP","Single","CSC"]
[null,null,null,"ZHOU FANGZHOU","U1022910H","SM3","SM2-AP/SM3","Single","MS"]
[null,null,null,"DONG XIAO","U1022911E","SM3","SM2-AP/SM3","Single","MAT"]
[null,null,null,"CHEN YAN","U1022912B","SM3","SM2-AP/SM3","Single","EEE"]
[null,null,null,"CHE BOYANG","U1022913K","SM2","SM2-RP","Single","MAT"]
[null,null,null,"XIE JINGYA","U1022914G","SM3","SM2-AP/SM3","Single","EEE"]
[null,null,null,"HAO YUNPENG","U1022915D","SM2","SM2-RP","Single","MS"]
[null,null,null,"ZHANG MENGYING","U1022916A","SM2","SM2-RP","Single","EEE"]
[null,null,null,"YUAN YI","U1022917J","SM2","SM2-RP","Single","EEE"]
[null,null,null,"YANG GUANG","U1022918F","SM2","SM2-RP","Double (Type 1)","BCG"]
[null,null,null,"LI XINGXI","U1022919C","SM2","SM2-RP","Single","MS"]
[null,null,null,"SHI YUANYUAN","U1022920F","SM2","SM2-RP","Single","EEE"]
[null,null,null,"WU LINYING","U1022921C","SM2","SM2-RP","Single","EEE"]
[null,null,null,"LI RUIXUE","U1022922L","SM2","SM2-RP","Double (Type 2)","IEEC"]
[null,null,null,"ZHU KANKANG","U1022923H","SM2","SM2-RP","Single","CEE"]
[null,null,null,"YANG MAN","U1022924E","SM3","SM2-AP/SM3","Single","MAT"]
[null,null,null,"XU JIAWEI","U1022926K","SM2","SM2-RP","Single","MS"]
[null,null,null,"CHEN FANGCHENG","U1022927G","SM2","SM2-RP","Single","MATH"]
[null,null,null,"YU XINYUAN","U1022928D","SM2","SM2-RP","Single","EEE"]
[null,null,null,"WANG DANDI","U1022929A","SM3","SM2-AP/SM3","Single","CEE"]
[null,null,null,"ZHANG YU","U1022930D","SM2","SM2-RP","Single","MAT"]
[null,null,null,"CHEN SIHUA","U1022931A","SM2","SM2-RP","Single","MS"]
[null,null,null,"WANG XILEI","U1022932J","SM2","SM2-RP","Single","EEE"]
[null,null,null,"ZHANG YAN","U1022933F","SM2","SM2-RP","Single","EEE"]
[null,null,null,"XU LIUJUN","U1022935L","SM3","SM2-AP/SM3","Single","MAT"]
[null,null,null,"HU FANGJIE","U1022936H","SM2","SM2-RP","Single","EEE"]
[null,null,null,"FENG SHUYING","U1022937E","SM2","SM2-RP","Single","EEE"]
[null,null,null,"WANG JIN","U1022938B","SM2","SM2-RP","Double (Type 1)","BCG"]
[null,null,null,"LUO JUN","U1022939K","SM2","SM2-RP","Single","EEE"]
[null,null,null,"DAI PEILUN","U1022940B","SM3","SM2-AP/SM3","Single","EEE"]
[null,null,null,"BI TIANMING","U1022941K","SM2","SM2-RP",{"$f":"VLOOKUP(I$1:I$5281,$A$37:$B$212,2,FALSE)","v":"Single"},"CE"]
[null,null,null,"ZHENG TINGTING","U1022942G","SM2","SM2-RP","Single","EEE"]
[null,null,null,"SUN JIANGBIN","U1022943D","SM2","SM2-RP","Single","EEE"]
[null,null,null,"CHEN SHAOXIANG","U1022944A","SM3","SM2-AP/SM3","Single","EEE"]
[null,null,null,"WANG PENG","U1022945J","SM3","SM2-AP/SM3","Single","EEE"]
[null,null,null,"XU FENG","U1022946F","SM2","SM2-RP","Double (Type 1)","BCG"]
[null,null,null,"QIU TIE","U1022947C","SM2","SM2-RP","Single","EEE"]
[null,null,null,"YIN RANRAN","U1022948L","SM2","SM2-RP","Double (Type 1)","BCG"]
[null,null,null,"WANG YUE","U1022949H","SM2","SM2-RP","Single","EEE"]
[null,null,null,"LI WEINI","U1022950L","SM2","SM2-RP","Single","IEM"]
[null,null,null,"QI WEN","U1022951H","SM3","SM2-AP/SM3","Single","EEE"]
[null,null,null,"ZENG JINGYUE","U1022952E","SM2","SM2-RP","Single","EEE"]
[null,null,null,"ZHANG XIAO","U1022953B","SM2","SM2-RP","Single","EEE"]
[null,null,null,"NIE XIAOLEI","U1022954K","SM2","SM2-RP","Single","BIE"]
[null,null,null,"LI QI","U1022955G","SM2","SM2-RP","Single","EEE"]
[null,null,null,"SHI QING","U1022956D","SM2","SM2-RP","Single","CSC"]
[null,null,null,"GONG LI","U1022957A","SM3","SM2-AP/SM3","Single","CE"]
[null,null,null,"LU MUZHOU","U1022959F","SM2","SM2-RP","Single","EEE"]
[null,null,null,"YIN HAIYAN","U1022960J","SM3","SM2-AP/SM3","Single","CE"]
[null,null,null,"HONG JIAAN","U1022962C","SM2","SM2-RP","Single","EEE"]
[null,null,null,"LIANG LINGXIAO","U1022963L","SM2","SM2-RP","Single","EEE"]
[null,null,null,"SHEN JING","U1022964H","SM3","SM2-AP/SM3","Single","EEE"]
[null,null,null,"GUO YITONG","U1022965E","SM2","SM2-RP","Single","EEE"]
[null,null,null,"XUE BING","U1022966B","SM2","SM2-RP","Single","EEE"]
[null,null,null,"LIU LETAO","U1022967K","SM2","SM2-RP","Single","EEE"]
[null,null,null,"CHEN GANLU","U1022968G","SM2","SM2-RP","Single","EEE"]
[null,null,null,"DUAN QINYANG","U1022969D","SM2","SM2-RP","Single","EEE"]
[null,null,null,"ZENG MENG","U1022970G","SM3","SM2-AP/SM3","Single","PHY"]
[null,null,null,"JING CHEN","U1022971D","SM2","SM2-RP","Single","ME"]
[null,null,null,"LIU BINGDA","U1022972A","SM2","SM2-RP","Single","ME"]
[null,null,null,"ZHU YIFAN","U1022973J","SM3","SM2-AP/SM3","Single","EEE"]
[null,null,null,"LIU KAI","U1022974F","SM2","SM2-RP","Single","IEM"]
[null,null,null,"JI YAXUE","U1022975C","SM3","SM2-AP/SM3","Single","MAT"]
[null,null,null,"MA JUN","U1022976L","SM3","SM2-AP/SM3","Single","EEE"]
[null,null,null,"ZHANG BO","U1022977H","SM2","SM2-RP","Single","EEE"]
[null,null,null,"LIU DONG","U1022978E","SM2","SM2-RP","Single","EEE"]
[null,null,null,"ZHANG YUXIAN","U1022979B","SM2","SM2-RP","Single","MAT"]
[null,null,null,"YANG SHAOBO","U1022980E","SM2","SM2-RP","Single","EEE"]
[null,null,null,"SHI YAN","U1022981B","SM2","SM2-RP","Single","EEE"]
[null,null,null,"LI KAIYUAN","U1022982K","SM3","SM2-AP/SM3","Single","EEE"]
[null,null,null,"QUAN LIJIE","U1022983G","SM2","SM2-RP","Single","EEE"]
[null,null,null,"YANG YONGZHONG","U1022984D","SM2 (Accelerated)","SM2-AP/SM3","Single","EEE"]
[null,null,null,"LIU YANLING","U1022985A","SM2","SM2-RP","Single","EEE"]
[null,null,null,"ZHANG MINGQIAN","U1022986J","SM2","SM2-RP","Single","CSC"]
[null,null,null,"YU HAIYANG","U1022987F","SM2","SM2-RP","Single","EEE"]
[null,null,null,"LI DONG","U1022988C","SM2","SM2-RP","Single","EEE"]
[null,null,null,"WANG HAOYING","U1022989L","SM2","SM2-RP","Single","EEE"]
[null,null,null,"LI YA","U1022990C","SM2","SM2-RP","Single","ENE"]
[null,null,null,"ZHANG SHU","U1022991L","SM2","SM2-RP","Single","IEM"]
[null,null,null,"DAI YAN","U1022993E","SM2","SM2-RP","Single","ME"]
[null,null,null,"LI XIANGYI","U1022995K","SM2","SM2-RP","Single","IEM"]
[null,null,null,"LIU CONG","U1022996G","SM2","SM2-RP","Single","EEE"]
[null,null,null,"YOU XUANGANG","U1022999J","SM2","SM2-RP","Single","BIE"]
[null,null,null,"LU JIAXI","U1023000F","SM2","SM2-RP","Single","MATH"]
[null,null,null,"WANG CHENGHONG","U1023001C","SM2","SM2-RP","Single","ENE"]
[null,null,null,"SHEN XINHUI","U1023002L","SM3","SM2-AP/SM3","Single","ME"]
[null,null,null,"XIAO FEI","U1023003H","SM3","SM2-AP/SM3","Single","EEE"]
[null,null,null,"ZHAO XINYUE","U1023004E","SM3","SM2-AP/SM3","Single","EEE"]
[null,null,null,"FU FANGWEI","U1023006K","SM2","SM2-RP","Single","EEE"]
[null,null,null,"LI YEJING","U1023007G","SM2","SM2-RP","Single","IEM"]
[null,null,null,"ZHAO YUN","U1023008D","SM2","SM2-RP","Single","MS"]
[null,null,null,"WANG PENG","U1023009A","SM2","SM2-RP","Single","EEE"]
[null,null,null,"LIU QIANG","U1023010D","SM3","SM2-AP/SM3","Single","EEE"]
[null,null,null,"WAN JIAHUAN","U1023011A","SM3","SM2-AP/SM3","Single","BIE"]
[null,null,null,"PAN RUOPING","U1023012J","SM3","SM2-AP/SM3",{"$f":"VLOOKUP(I$1:I$5281,$A$37:$B$212,2,FALSE)","v":"Single"},"EEE"]
[null,null,null,"LIANG SHANSHAN","U1023013F","SM3","SM2-AP/SM3","Single","EEE"]
[null,null,null,"ZHANG JING","U1023014C","SM3","SM2-AP/SM3","Single","EEE"]
[null,null,null,"LI LIANG","U1023015L","SM2","SM2-RP","Single","EEE"]
[null,null,null,"DING RUOHAN","U1023017E","SM2","SM2-RP","Single","EEE"]
[null,null,null,"ZHANG YUAN","U1023018B","SM3","SM2-AP/SM3","Single","MAEC"]
[null,null,null,"LU JIAN","U1023019K","SM3","SM2-AP/SM3","Single","EEE"]
[null,null,null,"ZHAO YUANYUAN","U1023020B","SM2","SM2-RP","Single","EEE"]
[null,null,null,"JU CHUANG","U1023023D","SM3","SM2-AP/SM3","Single","EEE"]
[null,null,null,"LU JIAXING","U1023039F","SM3","SM2-AP/SM3","Single","EEE"]
[null,null,null,"MA JIASHU","U1023040J","SM2","SM2-RP","Single","MAT"]
[null,null,null,"GAO MOCHEN","U1023044H","SM3","SM2-AP/SM3","Single","EEE"]
[null,null,null,"LIU QIJI","U1023045E","SM3","SM2-AP/SM3","Single","CE"]
[null,null,null,"YU JIAHANG","U1023085H","SM3","SM2-AP/SM3","Single","EEE"]
[null,null,null,"ARUNA HARSA NJOTOHARDJO","U1040059A","Direct","No bridging","Single","MAEC"]
[null,null,null,"CHRISTIAN WAHYUNUS PANGESTU","U1040061A","Direct","No bridging","Single","PHY"]
[null,null,null,"JODHI LEONATA PRATAMA","U1040070B","Direct","No bridging","Single","MAEC"]
[null,null,null,"RIRIN TAUFIK","U1040071K","Direct","No bridging","Single","MAEC"]
[null,null,null,"SHILTON JONATAN SALINDEHO","U1040073D","Direct","No bridging","Single","MAEC"]
[null,null,null,"HIROTO MULIA","U1040080L","Direct","No bridging","Single","MATH"]
[null,null,null,"MUHAMMAD AL ATIQI","U1040085G","Direct","No bridging","Single","PHY"]
[null,null,null,"CALVIN NATANAEL","U1040086D","Direct","No bridging","Single","MAEC"]
[null,null,null,"DELWIN KURNIA LIMAS","U1040088J","Direct","No bridging","Single","MATH"]
[null,null,null,"ADELIA VICANATALITA SUSANTO","U1040089F","Direct","No bridging","Single","CHEM"]
[null,null,null,"GOPALAKRISHNAN GAYATHRI","U1040642C","Direct","No bridging","Single","CSC"]
[null,null,null,"SHAO CHEN","U1040817J","MOE PreU Scholar (PRC)","No bridging","Single","MAEC"]
[null,null,null,"GAO MINLING","U1040833F","SM2","SM2-RP","Single","BS"]
[null,null,null,"TENG FEI","U1040834C","SM2","SM2-RP","Single","MATH"]
[null,null,null,"GAO HANXING","U1040836H","SM2 (Accelerated)","SM2-AP/SM3","Single","BS"]
[null,null,null,"ZOU JINGXI","U1040837E","SM2 (Accelerated)","SM2-AP/SM3","Single","CHEM"]
[null,null,null,"LIN JIANQING","U1040838B","SM3","SM2-AP/SM3","Single","BS"]
[null,null,null,"LIU SONGLIN","U1040839K","SM3","SM2-AP/SM3","Single","CHEM"]
[null,null,null,"WANG MANYU","U1040840B","SM2","SM2-RP","Single","CHEM"]
[null,null,null,"ZHANG NINGXIN","U1040841K","SM2","SM2-RP","Single","MAEC"]
[null,null,null,"WANG SHENG","U1040842G","SM3","SM2-AP/SM3","Single","MAEC"]
[null,null,null,"ZHANG WEIWEI","U1040843D","SM3","SM2-AP/SM3","Single","MAEC"]
[null,null,null,"YIN ZHAN","U1040844A","SM3","SM2-AP/SM3","Single","BS"]
[null,null,null,"WANG SHUO","U1040845J","SM2","SM2-RP","Single","MATH"]
[null,null,null,"JIANG HUISHEN","U1040846F","SM3","SM2-AP/SM3","Single","CHEM"]
[null,null,null,"LIANG JIAXING","U1040847C","SM3","SM2-AP/SM3","Single","MATH"]
[null,null,null,"WEI WEI","U1040848L","SM3","SM2-AP/SM3","Single","EEE"]
[null,null,null,"XIA ZENGZILU","U1040849H","SM3","SM2-AP/SM3","Single","CHEM"]
[null,null,null,"TAN XIN","U1040850L","SM2","SM2-RP","Single","MAEC"]
[null,null,null,"CHEN WENRUI","U1040851H","SM2","SM2-RP","Single","MAEC"]
[null,null,null,"SHAO YALING","U1040852E","SM3","SM2-AP/SM3","Single","CHEM"]
[null,null,null,"DUAN JUANYONG","U1040854K","SM2","SM2-RP","Single","MATH"]
[null,null,null,"GUAN MINGYANG","U1040855G","SM2","SM2-RP","Single","MAEC"]
[null,null,null,"MA DANGCHEN","U1040857A","SM2","SM2-RP","Single","CHEM"]
[null,null,null,"WANG ZHENJIA","U1040858J","SM3","SM2-AP/SM3","Single","CHEM"]
[null,null,null,"HONG SHENGKAI","U1040859F","SM2 (Accelerated)","SM2-AP/SM3","Single","MAEC"]
[null,null,null,"CHEN TINGTING","U1040860J","SM3","SM2-AP/SM3","Single","PHY"]
[null,null,null,"JIA HUAN","U1040861F","SM2","SM2-RP","Single","BS"]
[null,null,null,"WANG GUOXING","U1040862C","SM2 ","SM2-RP","Single","PHY"]
[null,null,null,"CHEN QINGJING","U1040863L","SM2","SM2-RP","Single","MATH"]
[null,null,null,"DAI FU","U1040864H","SM2","SM2-RP","Single","PHY"]
[null,null,null,"ZHOU YU","U1040865E","SM2 (Accelerated)","SM2-AP/SM3","Single","MAEC"]
[null,null,null,"LI XIAOZHANG","U1040866B","SM2","SM2-RP","Single","MAEC"]
[null,null,null,"HUANG XIN","U1040867K","SM3","SM2-AP/SM3","Single","PHY"]
[null,null,null,"JIANG TIANYI","U1040868G","SM2 (Accelerated)","SM2-AP/SM3","Single","MAEC"]
[null,null,null,"LIU YING","U1040869D","SM2","SM2-RP","Single","BS"]
[null,null,null,"ZHANG ZHEQI","U1040870G","SM2","SM2-RP","Single","MATH"]
[null,null,null,"RAN QIANDONG","U1040871D","SM2","SM2-RP","Single","PHY"]
[null,null,null,"ZHAO ZHENZHEN","U1040872A","SM2 (Accelerated)","SM2-AP/SM3","Single","MAEC"]
[null,null,null,"TIAN HUIDI","U1040873J","SM2","SM2-RP","Single","CHEM"]
[null,null,null,"JIANG RUNZHOU","U1040874F","SM2","SM2-RP",{"$f":"VLOOKUP(I$1:I$5281,$A$37:$B$212,2,FALSE)","v":"Single"},"EEE"]
[null,null,null,"LI JINGXI","U1040875C","SM2","SM2-RP","Single","MATH"]
[null,null,null,"LI BINGYU","U1040876L","SM2","SM2-RP","Single","MAEC"]
[null,null,null,"LIU WENRU","U1040877H","SM2","SM2-RP","Single","MAEC"]
[null,null,null,"SU LEI","U1040878E","SM3","SM2-AP/SM3","Single","PHY"]
[null,null,null,"CHEN XIAOXUAN","U1040879B","SM2","SM2-RP","Single","PHY"]
[null,null,null,"WANG WENYA","U1040880E","SM2 (Accelerated)","SM2-AP/SM3","Single","MATH"]
[null,null,null,"ZOU MENGLIN","U1040881B","SM2","SM2-RP","Single","EEE"]
[null,null,null,"ZHU JUNTING","U1040882K","SM2 (Accelerated)","SM2-AP/SM3","Single","EEE"]
[null,null,null,"DU SHUBO","U1040883G","SM2","SM2-RP","Single","CHEM"]
[null,null,null,"LI XING","U1040884D","SM2","SM2-RP","Single","CHEM"]
[null,null,null,"LIU WENJIA","U1040885A","SM2","SM2-RP","Single","EEE"]
[null,null,null,"HU BINGYANG","U1040886J","SM3","SM2-AP/SM3","Single","MATH"]
[null,null,null,"HE JINGXI","U1040887F","SM2","SM2-RP","Single","CHEM"]
[null,null,null,"QIAN CHENG","U1040888C","SM2","SM2-RP","Single","CSC"]
[null,null,null,"SONG YONGJIAN","U1040889L","SM2","SM2-RP","Single","MAEC"]
[null,null,null,"PU XIAOHENG","U1040890C","SM2","SM2-RP","Single","MATH"]
[null,null,null,"KUANG YIYUN","U1040891L","SM2","SM2-RP","Single","MATH"]
[null,null,null,"CAO WANGLI","U1040892H","SM3","SM2-AP/SM3","Single","CHEM"]
[null,null,null,"SU WEICONG","U1040893E","SM2","SM2-RP","Single","MAEC"]
[null,null,null,"JOSHUA HENDINATA","U1120128L","Direct (Indo SMA UAN)","No bridging","Single","CSC"]
[null,null,null,"KEVIN CHRISTANTO PUALAMSYAH","U1120129H","Direct (Indo SMA UAN)","No bridging","Single","EEE"]
[null,null,null,"ADHIPRASETYA PRAJNA MANGGALA","U1120141F","Direct (Indo SMA UAN)","No bridging","Single","BIE"]
[null,null,null,"MOHAMAD ICHIKO ABDUSSALAM","U1120182F","Direct (Indo SMA UAN)","No bridging","Single","EEE"]
[null,null,null,"KEVIN SUSANTO","U1120185H","Direct (Indo SMA UAN)","No bridging","Single","ME"]
[null,null,null,"MARTIN MARDJUKI","U1120201E","Direct (Indo SMA UAN)","No bridging","Single","MAT"]
[null,null,null,"LEONARDUS KEVIN ADITYA","U1120203K","Direct (Indo SMA UAN)","No bridging","Single","CBE"]
[null,null,null,"MARTIN FEBRIAN","U1120206A","Direct (Indo SMA UAN)","No bridging","Single","ME"]
[null,null,null,"HADY JANUAR WILLI","U1120209C","Direct (Indo SMA UAN)","No bridging","Single","CSC"]
[null,null,null,"JOSHUA EKA WARDHANA","U1120220D","Direct (Indo SMA UAN)","No bridging","Single","MAT"]
[null,null,null,"FRANKLIN TANDIAWAN","U1120229K","Direct (Indo SMA UAN)","No bridging","Single","EEE"]
[null,null,null,"STENER LIE","U1120258G","Direct (Indo SMA UAN)","No bridging","Single","MAT"]
[null,null,null,"RICKY WIJAYA","U1120276J","Direct (Indo SMA UAN)","No bridging","Single","ME"]
[null,null,null,"YANDI LAYADI LAY","U1120277F","Direct (Indo SMA UAN)","No bridging","Single","CEE"]
[null,null,null,"SOSALE BHARGAV","U1120674A","Direct (India Std XlI)","No bridging","Single","CSC"]
[null,null,null,"MITRA ADITYA","U1120675J","Direct (India Std XlI)","No bridging","Single","EEE"]
[null,null,null,"BHALLA JASKARAN SINGH","U1120676F","Direct (India Std XlI)","No bridging","Single","AERO"]
[null,null,null,"WANG YAXING","U1120711B","MOE PreU Scholar (PRC)","No bridging","Double (Type 2)","MEEC"]
[null,null,null,"LIU MEIXI","U1120715A","MOE PreU Scholar (PRC)","No bridging","Single","MS"]
[null,null,null,"LIAO SHUANG","U1120716J","MOE PreU Scholar (PRC)","No bridging","Single","MS"]
[null,null,null,"DU YIJUN","U1120753K","MOE PreU Scholar (PRC)","No bridging","Single","CSC"]
[null,null,null,"XIAO ZENGQI","U1120771A","MOE PreU Scholar (PRC)","No bridging","Single","MS"]
[null,null,null,"SONG ZHIWEI","U1120785J","MOE PreU Scholar (PRC)","No bridging","Double (Type 1)","BCG"]
[null,null,null,"LI HAORAN","U1120820E","MOE PreU Scholar (PRC)","No bridging","Single","MS"]
[null,null,null,"ZHOU WEI","U1120879A","MOE PreU Scholar (PRC)","No bridging","Single","EEE"]
[null,null,null,"LIU SIQING","U1120890B","MOE PreU Scholar (PRC)","No bridging","Single","MS"]
[null,null,null,"FU RONG","U1120942H","MOE PreU Scholar (PRC)","No bridging","Double (Type 1)","BCG"]
[null,null,null,"CHEN ZIYONG","U1121141J","MOE PreU Scholar (PRC)","No bridging","Single","CBE"]
[null,null,null,"BOSE SUBHODEEP","U1121543L","Direct (India Std XlI)","No bridging","Single","CSC"]
[null,null,null,"CAI XIAO","U1121674D","MOE PreU Scholar (PRC)","No bridging","Single","CEE"]
[null,null,null,"HAO RENJIE","U1121727G","MOE PreU Scholar (PRC)","No bridging","Single","CBE"]
[null,null,null,"TANG NINGRUI","U1121740B","MOE PreU Scholar (PRC)","No bridging","Single","AERO"]
[null,null,null,"WANG ZIYI","U1121770G","MOE PreU Scholar (PRC)","No bridging","Single","CBE"]
[null,null,null,"PULIANI VIDUR","U1121873L","Direct (India Std XlI)","No bridging","Single","CSC"]
[null,null,null,"SRIDHAR PRAKASH AMBARISH","U1121883J","Direct (India Std XlI)","No bridging","Single","CE"]
[null,null,null,"RACHAKONDA SUCHETHA","U1121963D","Direct (India Std XlI)","No bridging","Single","EEE"]
[null,null,null,"SUN ZHONGJI","U1121986B","MOE PreU Scholar (PRC)","No bridging","Single","AERO"]
[null,null,null,"VINCENT ANITA","U1122128F","Direct (India Std XlI)","No bridging","Single","BIE"]
[null,null,null,"VIJ AKRITI","U1122543C","Direct (India Std XlI)","No bridging","Single","CSC"]
[null,null,null,"MUKHERJEE SRIPORNA","U1122580D","Direct (India Std XlI)","No bridging","Single","CSC"]
[null,null,null,"SRIDHAR ASHWIN","U1122635A","Direct (India Std XlI)","No bridging","Single","EEE"]
[null,null,null,"MENDIRATTA SONAKSHI","U1122643E","Direct (India Std XlI)","No bridging","Single","CSC"]
[null,null,null,"KORDE SWARNIMA RAKESH","U1122648A","Direct (India Std XlI)","No bridging","Single","EEE"]
[null,null,null,"HOTCHANDANI RUCHI","U1122653C","Direct (India Std XlI)","No bridging","Single","BIE"]
[null,null,null,"SWAGATO SEN","U1122661G","GCE 'A' Level (S'PORE)","No bridging",{"$f":"VLOOKUP(I$1:I$5281,$A$37:$B$212,2,FALSE)","v":"Double (Type 2)"},"EEEC"]
[null,null,null,"RAKHI SINGH","U1122667L","Direct (India Std XlI)","No bridging","Single","CSC"]
[null,null,null,"UPADHYAY SANJANA","U1122709H","Direct (India Std XlI)","No bridging","Single","EEE"]
[null,null,null,"GAO YUAN","U1122732A","SM3","SM2-AP/SM3","Single","IEM"]
[null,null,null,"MAO YANG","U1122733J","SM3","SM2-AP/SM3","Double (Type 1)","BCG"]
[null,null,null,"NIE XIAO","U1122735C","SM2","SM2-RP","Single","CSC"]
[null,null,null,"WAN LIUYANG","U1122736L","SM2","SM2-RP","Single","CSC"]
[null,null,null,"YANG DUN","U1122737H","SM2","SM2-RP","Single","MS"]
[null,null,null,"XIA YE","U1122738E","SM2","SM2-RP","Double (Type 1)","BCG"]
[null,null,null,"FAN XIAOXUAN","U1122741B","SM3","SM2-AP/SM3","Double (Type 1)","BCE"]
[null,null,null,"ZHANG CHUNMENG","U1122743G","SM2","SM2-RP","Single","EEE"]
[null,null,null,"ZHANG YUXI","U1122744D","SM2","SM2-RP","Single","MAT"]
[null,null,null,"ZHANG XINGJIA","U1122745A","SM2","SM2-RP","Single","CSC"]
[null,null,null,"XING SHAN","U1122746J","SM2","SM2-RP","Single","EEE"]
[null,null,null,"LIU SONG","U1122747F","SM2","SM2-RP","Single","EEE"]
[null,null,null,"LIN YANJING","U1122748C","SM2","SM2-RP","Single","EEE"]
[null,null,null,"LIU QINGHUA","U1122749L","SM2","SM2-RP","Single","IEM"]
[null,null,null,"LIU JICHENG","U1122750C","SM3","SM2-AP/SM3","Single","EEE"]
[null,null,null,"LUO YIWEN","U1122751L","SM3","SM2-AP/SM3","Single","EEE"]
[null,null,null,"ZHENG XI","U1122752H","SM2","SM2-RP","Single","EEE"]
[null,null,null,"SONG HONGSHENG","U1122753E","SM3","SM2-AP/SM3","Single","EEE"]
[null,null,null,"LI YANGYANG","U1122754B","SM2","SM2-RP","Single","CEE"]
[null,null,null,"LUO YUN","U1122755K","SM2","SM2-RP","Single","EEE"]
[null,null,null,"ZHANG JINGLING","U1122756G","SM3","SM2-AP/SM3","Single","BIE"]
[null,null,null,"XIE YUFEI","U1122757D","SM3","SM2-AP/SM3","Single","BIE"]
[null,null,null,"YI FANGCHEN","U1122758A","SM2","SM2-RP","Single","MAT"]
[null,null,null,"QIAO CHENG","U1122759J","SM2","SM2-RP","Single","EEE"]
[null,null,null,"XIAO XIAO","U1122760A","SM3","SM2-AP/SM3","Single","EEE"]
[null,null,null,"LI SIYAO","U1122762F","SM2","SM2-RP","Double (Type 1)","BCG"]
[null,null,null,"LIU XIAO","U1122763C","SM2","SM2-RP","Double (Type 1)","BCE"]
[null,null,null,"ZHANG LIQUAN","U1122764L","SM3","SM2-AP/SM3","Single","EEE"]
[null,null,null,"CAO WENYU","U1122765H","SM2","SM2-RP","Single","ME"]
[null,null,null,"GU JINCHENG","U1122766E","SM2","SM2-RP","Single","EEE"]
[null,null,null,"YU YANG","U1122767B","SM3","SM2-AP/SM3","Single","BIE"]
[null,null,null,"GAO BO","U1122768K","SM3","SM2-AP/SM3","Single","EEE"]
[null,null,null,"CHU HAO","U1122769G","SM3","SM2-AP/SM3","Single","EEE"]
[null,null,null,"DAI YIYING","U1122770K","SM2","SM2-RP","Single","EEE"]
[null,null,null,"MA XINQI","U1122772D","SM3","SM2-AP/SM3","Single","EEE"]
[null,null,null,"ZHI WENYU","U1122774J","SM2","SM2-RP","Single","EEE"]
[null,null,null,"WANG GUANZHONG","U1122776C","SM3","SM2-AP/SM3","Single","EEE"]
[null,null,null,"GONG XUE","U1122777L","SM2","SM2-RP","Single","PHY"]
[null,null,null,"MA SIMIN","U1122778H","SM3","SM2-AP/SM3","Single","EEE"]
[null,null,null,"HUANG YIZHOU","U1122779E","SM3","SM2-AP/SM3","Single","CSC"]
[null,null,null,"WANG JUNJUN","U1122780H","SM3","SM2-AP/SM3","Single","EEE"]
[null,null,null,"LIN JUN","U1122781E","SM3","SM2-AP/SM3","Single","CSC"]
[null,null,null,"SU XIN","U1122782B","SM2","SM2-RP","Single","CBE"]
[null,null,null,"ZHANG WANGRAN","U1122783K","SM3","SM2-AP/SM3","Single","EEE"]
[null,null,null,"CHENG XU","U1122784G","SM3","SM2-AP/SM3","Single","ME"]
[null,null,null,"KONG QINGFEI","U1122785D","SM3","SM2-AP/SM3","Single","EEE"]
[null,null,null,"JI SHUANG","U1122786A","SM3","SM2-AP/SM3","Single","MAT"]
[null,null,null,"YANG YAJING","U1122787J","SM2","SM2-RP","Single","EEE"]
[null,null,null,"MA YUKUN","U1122788F","SM3","SM2-AP/SM3","Single","EEE"]
[null,null,null,"WU XUEJUN","U1122790F","SM2","SM2-RP","Single","CBE"]
[null,null,null,"DING HAOHANG","U1122791C","SM2","SM2-RP","Double (Type 1)","BCE"]
[null,null,null,"WANG KAILONG","U1122792L","SM3","SM2-AP/SM3","Single","EEE"]
[null,null,null,"CHEN YUMENG","U1122793H","SM2","SM2-RP","Single","ME"]
[null,null,null,"HUANG YUJIA","U1122794E","SM2","SM2-RP","Double (Type 1)","BCG"]
[null,null,null,"XU RAN","U1122795B","SM2","SM2-RP","Single","EEE"]
[null,null,null,"XU FEIFEI","U1122796K","SM2","SM2-RP","Single","EEE"]
[null,null,null,"CHANG JIAN","U1122797G","SM3","SM2-AP/SM3","Single","CBE"]
[null,null,null,"ZHANG WANQIAO","U1122798D","SM2","SM2-RP","Single","MAT"]
[null,null,null,"MIAO XUEQI","U1122799A","SM2","SM2-RP","Single","ENE"]
[null,null,null,"BAI SHUOYANG","U1122800D","SM2","SM2-RP","Single","EEE"]
[null,null,null,"JIN ZHIYAO","U1122801A","SM2","SM2-RP","Single","BIE"]
[null,null,null,"YANG FAN","U1122802J","SM3","SM2-AP/SM3",{"$f":"VLOOKUP(I$1:I$5281,$A$37:$B$212,2,FALSE)","v":"Single"},"MS"]
[null,null,null,"LI CHEN","U1122803F","SM2","SM2-RP","Double (Type 1)","BCE"]
[null,null,null,"AN XUEZHENG","U1122806H","SM3","SM2-AP/SM3","Single","CBE"]
[null,null,null,"DENG YUAN","U1122807E","SM2","SM2-RP","Double (Type 1)","BCG"]
[null,null,null,"ZHANG YIXUAN","U1122808B","SM2","SM2-RP","Single","EEE"]
[null,null,null,"YAO QINYI","U1122809K","SM2","SM2-RP","Single","ME"]
[null,null,null,"CAI YITONG","U1122810B","SM2","SM2-RP","Single","EEE"]
[null,null,null,"OUYANG XIN","U1122811K","SM2","SM2-RP","Single","MAT"]
[null,null,null,"LIU QIANQIAN","U1122812G","SM3","SM2-AP/SM3","Single","EEE"]
[null,null,null,"YU SIHAN","U1122813D","SM2","SM2-RP","Single","EEE"]
[null,null,null,"LIU JIN","U1122814A","SM3","SM2-AP/SM3","Single","EEE"]
[null,null,null,"XU XUANPING","U1122815J","SM2","SM2-RP","Single","CSC"]
[null,null,null,"CHENG WENWEN","U1122816F","SM2","SM2-RP","Single","MAT"]
[null,null,null,"LIU XINMIAO","U1122817C","SM2","SM2-RP","Single","ME"]
[null,null,null,"CAI WEIFAN","U1122818L","SM3","SM2-AP/SM3","Single","EEE"]
[null,null,null,"FENG YIRUI","U1122819H","SM2","SM2-RP","Single","CSC"]
[null,null,null,"WANG ZEGUO","U1122820L","SM3","SM2-AP/SM3","Single","CSC"]
[null,null,null,"YANG GUANG","U1122821H","SM2","SM2-RP","Single","CSC"]
[null,null,null,"HUANG TINGTING","U1122822E","SM3","SM2-AP/SM3","Single","EEE"]
[null,null,null,"FENG YUYUN","U1122823B","SM2","SM2-RP","Single","CEE"]
[null,null,null,"YIN YUAN","U1122824K","SM2","SM2-RP","Single","BIE"]
[null,null,null,"LIU JINGYANG","U1122825G","SM2","SM2-RP","Single","EEE"]
[null,null,null,"CHU XIAOQI","U1122826D","SM3","SM2-AP/SM3","Single","CSC"]
[null,null,null,"DUAN SHIQIANG","U1122827A","SM3","SM2-AP/SM3","Single","CSC"]
[null,null,null,"SONG KAI","U1122828J","SM2","SM2-RP","Single","BIE"]
[null,null,null,"WANG YANG","U1122829F","SM2","SM2-RP","Single","MAT"]
[null,null,null,"CHEN JUZHENG","U1122830J","SM2","SM2-RP","Single","ME"]
[null,null,null,"WANG QINYI","U1122831F","SM3","SM2-AP/SM3","Single","EEE"]
[null,null,null,"DUAN XINGQIANG","U1122832C","SM3","SM2-AP/SM3","Single","ME"]
[null,null,null,"LIU YUANDONG","U1122833L","SM2","SM2-RP","Single","ME"]
[null,null,null,"ZHAO XINZHU","U1122834H","SM2","SM2-RP","Double (Type 1)","BCG"]
[null,null,null,"CHANG ZHANHUA","U1122835E","SM2 (Accelerated)","SM2-AP/SM3","Single","EEE"]
[null,null,null,"XU MINGHAN","U1122836B","SM2","SM2-RP","Single","EEE"]
[null,null,null,"WANG JIEYUN","U1122837K","SM2","SM2-RP","Single","EEE"]
[null,null,null,"HUANG CHAOMIN","U1122838G","SM2","SM2-RP","Single","ENE"]
[null,null,null,"LONG ZHAOWEN","U1122839D","SM2","SM2-RP","Single","ME"]
[null,null,null,"WEI WAN","U1122840G","SM3","SM2-AP/SM3","Single","CBE"]
[null,null,null,"LI JING","U1122841D","SM3","SM2-AP/SM3","Single","EEE"]
[null,null,null,"GUO SONG","U1122842A","SM3","SM2-AP/SM3","Single","EEE"]
[null,null,null,"MA YUE","U1122843J","SM2","SM2-RP","Single","CBE"]
[null,null,null,"CHEN YUCHI","U1122844F","SM2","SM2-RP","Single","EEE"]
[null,null,null,"YUN YIKE","U1122845C","SM2","SM2-RP","Single","ME"]
[null,null,null,"ZHANG XUYANG","U1122846L","SM3","SM2-AP/SM3","Single","BIE"]
[null,null,null,"CHEN QIXING","U1122847H","SM3","SM2-AP/SM3","Single","EEE"]
[null,null,null,"ZHOU TIANBO","U1122848E","SM3","SM2-AP/SM3","Single","EEE"]
[null,null,null,"XUE YUHAI","U1122849B","SM2","SM2-RP","Single","CSC"]
[null,null,null,"ZHANG WENCHAO","U1122850E","SM3","SM2-AP/SM3","Single","MS"]
[null,null,null,"LIU RUICHENG","U1122851B","SM2","SM2-RP","Single","CSC"]
[null,null,null,"BAI XIWEN","U1122852K","SM3","SM2-AP/SM3","Single","MS"]
[null,null,null,"LIU HONGYANG","U1122853G","SM2","SM2-RP","Single","EEE"]
[null,null,null,"HE MEIJIE","U1122854D","SM2","SM2-RP","Single","IEM"]
[null,null,null,"CUI WEI","U1122855A","SM2","SM2-RP","Single","EEE"]
[null,null,null,"LI XIAOTONG","U1122856J","SM3","SM2-AP/SM3","Single","ME"]
[null,null,null,"LI YANG","U1122857F","SM3","SM2-AP/SM3","Single","EEE"]
[null,null,null,"WANG XINLING","U1122858C","SM3","SM2-AP/SM3","Single","IEM"]
[null,null,null,"ZHU CHENYANG","U1122859L","SM3","SM2-AP/SM3","Single","CE"]
[null,null,null,"YU YINGCHEN","U1122860C","SM3","SM2-AP/SM3","Single","EEE"]
[null,null,null,"HU TIANTIAN","U1122861L","SM3","SM2-AP/SM3","Single","MS"]
[null,null,null,"FU ZHUXUAN","U1122862H","SM3","SM2-AP/SM3","Single","EEE"]
[null,null,null,"LIU QINGLAI","U1122864B","SM3","SM2-AP/SM3","Single","EEE"]
[null,null,null,"HUANG JUNYE","U1122866G","SM3","SM2-AP/SM3","Single","MAT"]
[null,null,null,"KONG CHAO","U1122867D","SM3","SM2-AP/SM3","Single","EEE"]
[null,null,null,"ZHAO YONGHAO","U1122868A","SM3","SM2-AP/SM3","Single","EEE"]
[null,null,null,"CHEN MENGXUAN","U1122869J","SM3","SM2-AP/SM3","Single","CSC"]
[null,null,null,"YE YIYANG","U1122870A","SM3","SM2-AP/SM3",{"$f":"VLOOKUP(I$1:I$5281,$A$37:$B$212,2,FALSE)","v":"Single"},"EEE"]
[null,null,null,"XU MENGYAO","U1122871J","SM3","SM2-AP/SM3","Single","IEM"]
[null,null,null,"ZHANG MENGXUAN","U1122872F","SM3","SM2-AP/SM3","Double (Type 1)","BCG"]
[null,null,null,"ZHANG YE","U1122873C","SM2","SM2-RP","Single","EEE"]
[null,null,null,"LIU CHAOQUN","U1122874L","SM3","SM2-AP/SM3","Single","EEE"]
[null,null,null,"LIU ZHE","U1122875H","SM2","SM2-RP","Single","CBE"]
[null,null,null,"GUO XINTONG","U1122876E","SM3","SM2-AP/SM3","Single","MAT"]
[null,null,null,"WANG XIAOHENG","U1122877B","SM3","SM2-AP/SM3","Single","EEE"]
[null,null,null,"PAN YUEHAO","U1122879G","SM2","SM2-RP","Single","IEM"]
[null,null,null,"TIAN MAOKUN","U1122880K","SM2","SM2-RP","Single","CSC"]
[null,null,null,"XU ZHENGZI","U1122881G","SM2","SM2-RP","Single","CSC"]
[null,null,null,"SU DINGDIAN","U1122882D","SM3","SM2-AP/SM3","Single","CBE"]
[null,null,null,"XU XUEWEI","U1122883A","SM2","SM2-RP","Single","MS"]
[null,null,null,"ZHANG ZHUZHEFU","U1122884J","SM3","SM2-AP/SM3","Double (Type 1)","BCG"]
[null,null,null,"CHEN YE","U1122886C","SM3","SM2-AP/SM3","Single","MAT"]
[null,null,null,"XU WEI","U1122887L","SM3","SM2-AP/SM3","Double (Type 1)","BCG"]
[null,null,null,"MOU BOXIN","U1122888H","SM2","SM2-RP","Single","EEE"]
[null,null,null,"WANG YUCHEN","U1122889E","SM3","SM2-AP/SM3","Single","MAT"]
[null,null,null,"LIU XI","U1122890H","SM2 (Accelerated)","SM2-AP/SM3","Single","EEE"]
[null,null,null,"SUN YI","U1122891E","SM3","SM2-AP/SM3","Single","EEE"]
[null,null,null,"GUO FANGFANG","U1122892B","SM3","SM2-AP/SM3","Single","BIE"]
[null,null,null,"YUE XITONG","U1122893K","SM2","SM2-RP","Single","EEE"]
[null,null,null,"JING WEI","U1122894G","SM3","SM2-AP/SM3","Single","ME"]
[null,null,null,"ZENG ZHIWEI","U1122895D","SM2","SM2-RP","Double (Type 1)","BCG"]
[null,null,null,"ZHU DAIQING","U1122896A","SM3","SM2-AP/SM3","Single","CSC"]
[null,null,null,"ZHU WANZHENG","U1122897J","SM3","SM2-AP/SM3","Single","EEE"]
[null,null,null,"LIU GUANQUN","U1122898F","SM2","SM2-RP","Single","EEE"]
[null,null,null,"XIAO JIACHEN","U1122899C","SM3","SM2-AP/SM3","Single","CBE"]
[null,null,null,"LIU SHURUI","U1122900F","SM3","SM2-AP/SM3","Single","EEE"]
[null,null,null,"ZHANG RUOCHONG","U1122901C","SM2 (Accelerated)","SM2-AP/SM3","Single","EEE"]
[null,null,null,"HU SIHUI","U1122902L","SM2 (Accelerated)","SM2-AP/SM3","Single","CBE"]
[null,null,null,"LIU YUE","U1122903H","SM3","SM2-AP/SM3","Single","CBE"]
[null,null,null,"LAI WENJIE","U1122905B","SM3","SM2-AP/SM3","Single","ME"]
[null,null,null,"WU YIFENG","U1122906K","SM3","SM2-AP/SM3","Single","CSC"]
[null,null,null,"ZHANG DI","U1122907G","SM2","SM2-RP","Single","EEE"]
[null,null,null,"YE PENGCHENG","U1122908D","SM3","SM2-AP/SM3","Single","MAT"]
[null,null,null,"ZHENG ZHIPENG","U1122909A","SM2 (Accelerated)","SM2-AP/SM3","Double (Type 1)","BCE"]
[null,null,null,"YIN HONGXU","U1122910D","SM3","SM2-AP/SM3","Single","EEE"]
[null,null,null,"MIN MIAOLIN","U1122911A","SM2","SM2-RP","Single","CE"]
[null,null,null,"ZHOU SHITONG","U1122912J","SM2","SM2-RP","Single","EEE"]
[null,null,null,"CHENG HUAN","U1122913F","SM3","SM2-AP/SM3","Single","EEE"]
[null,null,null,"ZHAO ZIPING","U1122915L","SM3","SM2-AP/SM3","Single","EEE"]
[null,null,null,"WU CHENG","U1122916H","SM2","SM2-RP","Single","ME"]
[null,null,null,"TANG TINGTING","U1122917E","SM2","SM2-RP","Single","MS"]
[null,null,null,"HUANG YIXUAN","U1122918B","SM2","SM2-RP","Double (Type 1)","BCG"]
[null,null,null,"YANG JINGCAN","U1122919K","SM2","SM2-RP","Single","CSC"]
[null,null,null,"DU WEIWEI","U1122920B","SM3","SM2-AP/SM3","Single","EEE"]
[null,null,null,"MA YUAN","U1122921K","SM2","SM2-RP","Single","EEE"]
[null,null,null,"ZHANG JINGYUN","U1122922G","SM3","SM2-AP/SM3","Single","BIE"]
[null,null,null,"LI MINGZE","U1122923D","SM3","SM2-AP/SM3","Single","EEE"]
[null,null,null,"CAO WEIDONG","U1122924A","SM3","SM2-AP/SM3","Single","EEE"]
[null,null,null,"LUO WENJIE","U1122925J","SM3","SM2-AP/SM3","Single","EEE"]
[null,null,null,"HUANG JUNWEI","U1122926F","SM2 (Accelerated)","SM2-AP/SM3","Single","EEE"]
[null,null,null,"SHI RAN","U1122927C","SM2","SM2-RP","Single","BIE"]
[null,null,null,"WU YUANYUAN","U1122928L","SM2","SM2-RP","Single","MAT"]
[null,null,null,"XU LINGCHAO","U1122929H","SM2","SM2-RP","Single","EEE"]
[null,null,null,"HUANG JIAZHAO","U1122930L","SM2","SM2-RP","Single","ME"]
[null,null,null,"TANG JUNBIN","U1122931H","SM2","SM2-RP","Single","CBE"]
[null,null,null,"CAI XIAOXUAN","U1122932E","SM3","SM2-AP/SM3","Single","CSC"]
[null,null,null,"XIE YUTIAN","U1122933B","SM3","SM2-AP/SM3","Single","IEM"]
[null,null,null,"ZHANG BOYUAN","U1122934K","SM2","SM2-RP","Single","EEE"]
[null,null,null,"TANG NITING","U1122935G","SM3","SM2-AP/SM3","Single","EEE"]
[null,null,null,"XU YI","U1122936D","SM2 (Accelerated)","SM2-AP/SM3","Double (Type 1)","BCG"]
[null,null,null,"NIE HELEI","U1122937A","SM2","SM2-RP","Single","EEE"]
[null,null,null,"YU XIANG","U1122938J","SM3","SM2-AP/SM3",{"$f":"VLOOKUP(I$1:I$5281,$A$37:$B$212,2,FALSE)","v":"Single"},"ME"]
[null,null,null,"CI RUIXIANG","U1122939F","SM3","SM2-AP/SM3","Single","MAT"]
[null,null,null,"LIU XIAO","U1122940J","SM3","SM2-AP/SM3","Single","CSC"]
[null,null,null,"CHEN BAIMEI","U1122942C","SM2","SM2-RP","Single","EEE"]
[null,null,null,"LU DEEN","U1122943L","SM3","SM2-AP/SM3","Single","CSC"]
[null,null,null,"LIU XUYAO","U1122944H","SM2","SM2-RP","Single","CBE"]
[null,null,null,"ZHANG YEXIN","U1122945E","SM3","SM2-AP/SM3","Single","EEE"]
[null,null,null,"WANG YICHEN","U1122946B","SM2 (Accelerated)","SM2-AP/SM3","Single","CSC"]
[null,null,null,"HUANG XINXIN","U1122947K","SM2","SM2-RP","Single","CBE"]
[null,null,null,"LIAO SHANSHAN","U1122948G","SM3","SM2-AP/SM3","Single","BIE"]
[null,null,null,"ZHAO ANQI","U1122949D","SM3","SM2-AP/SM3","Single","MAT"]
[null,null,null,"SHU WEIQI","U1122950G","SM2","SM2-RP","Single","EEE"]
[null,null,null,"GENG WEIDA","U1122951D","SM3","SM2-AP/SM3","Single","EEE"]
[null,null,null,"KONG XIAOLU","U1122952A","SM2","SM2-RP","Single","EEE"]
[null,null,null,"ZHANG YAN","U1122953J","SM2","SM2-RP","Single","ME"]
[null,null,null,"ZHANG CHIXIONG","U1122954F","SM2","SM2-RP","Single","CSC"]
[null,null,null,"WANG YU","U1122955C","SM3","SM2-AP/SM3","Single","EEE"]
[null,null,null,"LI XIAOGUO","U1122956L","SM2","SM2-RP","Single","ME"]
[null,null,null,"LI SIYAN","U1122957H","SM2","SM2-RP","Single","EEE"]
[null,null,null,"FENG YUXI","U1122958E","SM3","SM2-AP/SM3","Single","EEE"]
[null,null,null,"ZHOU FAN","U1122959B","SM2","SM2-RP","Double (Type 1)","BCG"]
[null,null,null,"SHI YIRAN","U1122960E","SM2","SM2-RP","Single","MAT"]
[null,null,null,"ZHANG MENG","U1122961B","SM3","SM2-AP/SM3","Single","EEE"]
[null,null,null,"GE WEITONG","U1122962K","SM3","SM2-AP/SM3","Single","EEE"]
[null,null,null,"ZHAN JING","U1122963G","SM2","SM2-RP","Single","MAT"]
[null,null,null,"TAO QINGYI","U1122964D","SM2","SM2-RP","Single","CSC"]
[null,null,null,"YANG WANQING","U1122965A","SM3","SM2-AP/SM3","Double (Type 1)","BCG"]
[null,null,null,"ZHANG SIYUAN","U1122966J","SM3","SM2-AP/SM3","Single","EEE"]
[null,null,null,"CHEN HAOTING","U1122967F","SM2 (Accelerated)","SM2-AP/SM3","Single","CSC"]
[null,null,null,"JIANG YUNXIANG","U1122968C","SM3","SM2-AP/SM3","Single","EEE"]
[null,null,null,"LIANG TIANCHI","U1122969L","SM2","SM2-RP","Single","EEE"]
[null,null,null,"ZHAO TIANSI","U1122972H","SM3","SM2-AP/SM3","Single","EEE"]
[null,null,null,"SONG YU","U1122973E","SM2","SM2-RP","Single","EEE"]
[null,null,null,"ZHOU YINGYING","U1122974B","SM2","SM2-RP","Single","BIE"]
[null,null,null,"LU YANG","U1122975K","SM2 (Accelerated)","SM2-AP/SM3","Single","ME"]
[null,null,null,"CAI XIAO","U1122976G","SM2","SM2-RP","Single","EEE"]
[null,null,null,"LI ZHI","U1122978A","SM3","SM2-AP/SM3","Single","EEE"]
[null,null,null,"DING XIANGBIN","U1122979J","SM3","SM2-AP/SM3","Single","EEE"]
[null,null,null,"HE PEIMING","U1122980A","SM2","SM2-RP","Single","MAT"]
[null,null,null,"YANG XIAO","U1122981J","SM3","SM2-AP/SM3","Single","CBE"]
[null,null,null,"HAN XU","U1122982F","SM2 (Accelerated)","SM2-AP/SM3","Single","CBE"]
[null,null,null,"ZHANG DANYANG","U1122983C","SM2 (Accelerated)","SM2-AP/SM3","Double (Type 1)","BCG"]
[null,null,null,"WEI RAN","U1122985H","SM2","SM2-RP","Single","IEM"]
[null,null,null,"MAO WENJIAN","U1122987B","SM2","SM2-RP","Single","EEE"]
[null,null,null,"LUO JING","U1122988K","SM2","SM2-RP","Single","MS"]
[null,null,null,"MO RUFAN","U1122989G","SM3","SM2-AP/SM3","Single","EEE"]
[null,null,null,"ZHAO YING","U1122990K","SM3","SM2-AP/SM3","Single","MS"]
[null,null,null,"TANG JINKAI","U1122992D","SM2","SM2-RP","Single","MAT"]
[null,null,null,"CHEN SIJIA","U1122993A","SM2","SM2-RP","Single","IEM"]
[null,null,null,"CHEN YONG","U1122994J","SM3","SM2-AP/SM3","Single","EEE"]
[null,null,null,"CHEN WEI","U1122995F","SM3","SM2-AP/SM3","Single","CSC"]
[null,null,null,"ZENG FEIFAN","U1122996C","SM3","SM2-AP/SM3","Single","CSC"]
[null,null,null,"LIU HUANYU","U1122997L","SM2","SM2-RP","Single","EEE"]
[null,null,null,"LIU YIPENG","U1122998H","SM3","SM2-AP/SM3","Single","EEE"]
[null,null,null,"LIU XIAO","U1122999E","SM3","SM2-AP/SM3","Single","EEE"]
[null,null,null,"LIN YING","U1123000B","SM3","SM2-AP/SM3","Single","MS"]
[null,null,null,"SONG ZUJIA","U1123001K","SM2","SM2-RP","Single","ME"]
[null,null,null,"ZHOU YI","U1123002G","SM2","SM2-RP","Single","EEE"]
[null,null,null,"LI YIHAN","U1123004A","SM2","SM2-RP","Single","IEM"]
[null,null,null,"ZHANG NAN","U1123030G","SM2","SM2-RP","Single","IEM"]
[null,null,null,"ZHANG NAN","U1123056G","SM2","SM2-RP","Single","CE"]
[null,null,null,"WANG YIHE","U1123110B","SM3","SM2-AP/SM3","Single","EEE"]
[null,null,null,"EDWARD ANTHONY LIM","U1140057C","Direct (Indo SMA UAN)","No bridging","Single","MAEC"]
[null,null,null,"MIECHIE","U1140078G","Direct (Indo SMA UAN)","No bridging","Single","CHEM"]
[null,null,null,"RAY FELLIX GANARDI","U1140086L","Direct (Indo SMA UAN)","No bridging",{"$f":"VLOOKUP(I$1:I$5281,$A$37:$B$212,2,FALSE)","v":"Single"},"PHY"]
[null,null,null,"LINDSAY SUNHENDRA JAP","U1140089B","Direct (Indo SMA UAN)","No bridging","Single","MATH"]
[null,null,null,"IVAN WANGSACIPTALINGGA","U1140103E","Direct (Indo SMA UAN)","No bridging","Single","MATH"]
[null,null,null,"KAUSHIK RINSHA","U1140166F","Direct (India Std XlI)","No bridging","Single","CSC"]
[null,null,null,"SHENG JIAO","U1140201B","MOE PreU Scholar (PRC)","No bridging","Single","MAEC"]
[null,null,null,"SHENG CHAO","U1140208C","MOE PreU Scholar (PRC)","No bridging","Single","MAEC"]
[null,null,null,"YI XIN","U1140214B","MOE PreU Scholar (PRC)","No bridging","Single","MAEC"]
[null,null,null,"WICKRAMAGE DON SADEEP MADURANGE","U1140287A","MOE PreU Scholar (Sri Lanka)","No bridging","Single","MATH"]
[null,null,null,"SENTHIL SHARADKUMAR PANDIAN","U1140779G","Direct (India Std XlI)","No bridging","Single","PHY"]
[null,null,null,"FANG ZHE","U1140922J","SM2","SM2-RP","Single","PHY"]
[null,null,null,"DING LU","U1140923F","SM2","SM2-RP","Single","MAEC"]
[null,null,null,"WU TONG","U1140924C","SM2","SM2-RP","Single","MATH"]
[null,null,null,"GAO SANGDI","U1140925L","SM3","SM2-AP/SM3","Single","MATH"]
[null,null,null,"GENG BOJIAN","U1140926H","SM3","SM2-AP/SM3","Single","BS"]
[null,null,null,"ZHANG JIABI","U1140927E","SM3","SM2-AP/SM3","Single","MATH"]
[null,null,null,"ZENG XIAOYUN","U1140928B","SM2","SM2-RP","Single","MATH"]
[null,null,null,"LIU YIHAN","U1140929K","SM2","SM2-RP","Single","MATH"]
[null,null,null,"CHEN XI","U1140930B","SM2","SM2-RP","Single","MAEC"]
[null,null,null,"DONG BOWEI","U1140931K","SM2","SM2-RP","Single","PHY"]
[null,null,null,"ZOU XI","U1140932G","SM3","SM2-AP/SM3","Single","MATH"]
[null,null,null,"YANG DONGLEI","U1140933D","SM3","SM2-AP/SM3","Single","MATH"]
[null,null,null,"FANG ZEWEN","U1140934A","SM2","SM2-RP","Single","MATH"]
[null,null,null,"LU ZIHUI","U1140935J","SM3","SM2-AP/SM3","Single","BS"]
[null,null,null,"PENG SHIQI","U1140936F","SM2","SM2-RP","Single","MAEC"]
[null,null,null,"YUAN ZIHAN","U1140937C","SM2 (Accelerated)","SM2-AP/SM3","Single","MAEC"]
[null,null,null,"LIU YANXIONG","U1140938L","SM3","SM2-AP/SM3","Single","MAEC"]
[null,null,null,"RUI YUNFAN","U1140939H","SM3","SM2-AP/SM3","Single","BS"]
[null,null,null,"JIN SHENGYANG","U1140941H","SM2","SM2-RP","Single","BS"]
[null,null,null,"REN QUNFANG","U1140942E","SM3","SM2-AP/SM3","Single","BS"]
[null,null,null,"LI PENGJIA","U1140943B","SM2","SM2-RP","Single","MAEC"]
[null,null,null,"YUAN BOYA","U1140944K","SM2","SM2-RP","Single","MATH"]
[null,null,null,"JIN WEI","U1140945G","SM3","SM2-AP/SM3","Single","MATH"]
[null,null,null,"LIU CHONG","U1140946D","SM3","SM2-AP/SM3","Single","BS"]
[null,null,null,"ZHAO CHENG","U1140947A","SM3","SM2-AP/SM3","Single","MATH"]
[null,null,null,"WEI RAN","U1140948J","SM2 (Accelerated)","SM2-AP/SM3","Single","MAEC"]
[null,null,null,"LU QIAN","U1140949F","SM3","SM2-AP/SM3","Single","MAEC"]
[null,null,null,"LIU CHAO","U1140950J","SM3","SM2-AP/SM3","Single","MAEC"]
[null,null,null,"WANG YINGQI","U1140951F","SM2","SM2-RP","Single","BS"]
[null,null,null,"LIU YANG","U1140952C","SM2","SM2-RP","Single","CHEM"]
[null,null,null,"LUO YANG","U1140953L","SM3","SM2-AP/SM3","Single","CHEM"]
[null,null,null,"ZHANG YUEJIAO","U1140954H","SM2","SM2-RP","Single","MAEC"]
[null,null,null,"DU SHANGZHU","U1140955E","SM3","SM2-AP/SM3","Single","MAEC"]
[null,null,null,"WEN SHAOYI","U1140956B","SM2 (Accelerated)","SM2-AP/SM3","Single","MAEC"]
[null,null,null,"FU YINGYU","U1140957K","SM3","SM2-AP/SM3","Single","MAEC"]
[null,null,null,"ZHU SHITONG","U1140958G","SM3","SM2-AP/SM3","Single","MAEC"]
[null,null,null,"JI WEIJIE","U1140959D","SM3","SM2-AP/SM3","Single","CHEM"]
[null,null,null,"MA LINGJIE","U1140960G","SM2 (Accelerated)","SM2-AP/SM3","Single","PHY"]
[null,null,null,"JIANG XINYI","U1140961D","SM2 (Accelerated)","SM2-AP/SM3","Single","MAEC"]
[null,null,null,"TIAN KEYIN","U1140962A","SM3","SM2-AP/SM3","Single","CHEM"]
[null,null,null,"JIN CHUQING","U1140963J","SM2 (Accelerated)","SM2-AP/SM3","Single","MAEC"]
[null,null,null,"BAO XIAOKE","U1140964F","SM3","SM2-AP/SM3","Single","MATH"]
[null,null,null,"PAN JIACHENG","U1140965C","SM2 (Accelerated)","SM2-AP/SM3","Single","MAEC"]
[null,null,null,"SUN KAIXUAN","U1140966L","SM3","SM2-AP/SM3","Single","PHY"]
[null,null,null,"YOU JIAHUA","U1140967H","SM2 (Accelerated)","SM2-AP/SM3","Single","MATH"]
[null,null,null,"ZHENG QI","U1140968E","SM2","SM2-RP","Single","MAEC"]
[null,null,null,"ZHANG TONG","U1140969B","SM2","SM2-RP","Single","MAEC"]
[null,null,null,"LIAO ZHAOPENG","U1140970E","SM2","SM2-RP","Single","MAEC"]
[null,null,null,"YANG CHUYI","U1140971B","SM2","SM2-RP","Single","MAEC"]
[null,null,null,"CHEN PENGHUA","U1140972K","SM3","SM2-AP/SM3","Single","PHY"]
[null,null,null,"LI XUEQING","U1140973G","SM3","SM2-AP/SM3","Single","MAEC"]
[null,null,null,"SONG WENJIA","U1140974D","SM2","SM2-RP","Single","MATH"]
[null,null,null,"LIU JINGTING","U1140975A","SM2","SM2-RP","Single","MATH"]
[null,null,null,"HAN YUE","U1140976J","SM3","SM2-AP/SM3","Single","MATH"]
[null,null,null,"YU WEI","U1140977F","SM2","SM2-RP","Single","MATH"]
[null,null,null,"CHEN LIN","U1140978C","SM2 (Accelerated)","SM2-AP/SM3",{"$f":"VLOOKUP(I$1:I$5281,$A$37:$B$212,2,FALSE)","v":"Single"},"MAEC"]
[null,null,null,"CHEN LETIAN","U1140979L","SM2","SM2-RP","Single","MAEC"]
[null,null,null,"XU JINGXUAN","U1140980C","SM2","SM2-RP","Single","MATH"]
[null,null,null,"BAI CHONG","U1140981L","SM3","SM2-AP/SM3","Single","MAEC"]
[null,null,null,"XU YU","U1140982H","SM3","SM2-AP/SM3","Single","PHY"]
[null,null,null,"YANG QIANYU","U1140983E","SM3","SM2-AP/SM3","Single","MATH"]
[null,null,null,"YE KANGTING","U1140984B","SM2","SM2-RP","Single","MAEC"]
[null,null,null,"YANG YI","U1140985K","SM2","SM2-RP","Single","MAEC"]
[null,null,null,"ZHANG JIASHENG","U1140986G","SM3","SM2-AP/SM3","Single","MAEC"]
[null,null,null,"WANG XIAOYE","U1141001A","SM2","SM2-RP","Single","MATH"]
[null,null,null,"AGUSTINUS BENYAMIN PRASETYO","U1220051J","Direct (Indo SMA UAN)","No bridging","Single","ME"]
[null,null,null,"RAYMOND DJAJALAKSANA","U1220053C","Direct (Indo SMA UAN)","No bridging","Single","ME"]
[null,null,null,"DILLON AMADEO WIRANTONO GOEIJ","U1220076A","Direct (Indo SMA UAN)","No bridging","Single","CSC"]
[null,null,null,"NICHOLAS","U1220094C","Direct (Indo SMA UAN)","No bridging","Single","MAT"]
[null,null,null,"FELICIA MEIRIANI","U1220109H","Direct (Indo SMA UAN)","No bridging","Single","ME"]
[null,null,null,"ANDRI SETIAWAN","U1220110L","Direct (Indo SMA UAN)","No bridging","Single","EEE"]
[null,null,null,"ANDY","U1220112E","Direct (Indo SMA UAN)","No bridging","Single","CEE"]
[null,null,null,"IRYANTO JAYA","U1220113B","Direct (Indo SMA UAN)","No bridging","Single","CSC"]
[null,null,null,"GREGORIUS MARCO","U1220117A","Direct (Indo SMA UAN)","No bridging","Single","ME"]
[null,null,null,"GHIFARI RAHADIAN","U1220124H","Direct (Indo SMA UAN)","No bridging","Single","EEE"]
[null,null,null,"CHRISTIANDY FRANCISCUS","U1220137H","Direct (Indo SMA UAN)","No bridging","Single","CEE"]
[null,null,null,"LEONARD","U1220140E","Direct (Indo SMA UAN)","No bridging","Single","EEE"]
[null,null,null,"LI TIANZE","U1220464F","SM2","SM2 (20 MTHS)","Single","ME"]
[null,null,null,"ZHAN XIAOYING","U1220466L","SM2","SM2 (20 MTHS)","Double (Type 1)","BCG"]
[null,null,null,"WU CHUXIAO","U1220467H","SM2","SM2 (20 MTHS)","Single","ME"]
[null,null,null,"LIU ZHITONG","U1220468E","SM2","SM2 (20 MTHS)","Single","ME"]
[null,null,null,"LI XIAOXUAN","U1220469B","SM2","SM2 (12 MTHS)","Single","MAT"]
[null,null,null,"AN QI","U1220470E","SM2","SM2 (20 MTHS)","Single","EEE"]
[null,null,null,"LI YUEKANG","U1220472K","SM3","SM2 (20 MTHS)","Single","CSC"]
[null,null,null,"XU WEINAN","U1220473G","SM3","SM2 (20 MTHS)","Double (Type 1)","BCG"]
[null,null,null,"WANG XIAOHAN","U1220475A","SM2","SM2 (20 MTHS)","Single","CSC"]
[null,null,null,"FU SHIWEN","U1220476J","SM2","SM2 (20 MTHS)","Single","MS"]
[null,null,null,"HU ZHAONING","U1220477F","SM3","SM2 (20 MTHS)","Single","MAT"]
[null,null,null,"YUAN ZIJIE","U1220479L","SM2","SM2 (20 MTHS)","Single","CE"]
[null,null,null,"LIU HAICHUAN","U1220480C","SM3","SM2 (20 MTHS)","Single","ME"]
[null,null,null,"JIANG SHAN","U1220481L","SM3","SM2 (20 MTHS)","Single","EEE"]
[null,null,null,"DONG FANGMING","U1220483E","SM2","SM2 (20 MTHS)","Single","EEE"]
[null,null,null,"HUANG CHENYU","U1220484B","SM3","SM2 (12MTHS)","Single","EEE"]
[null,null,null,"HONG ANDI","U1220485K","SM2","SM2 (20 MTHS)","Single","BIE"]
[null,null,null,"SUN JING","U1220486G","SM2","SM2 (20 MTHS)","Single","EEE"]
[null,null,null,"XU JUNSHI","U1220488A","SM2","SM2 (20 MTHS)","Single","ME"]
[null,null,null,"DONG YUBO","U1220489J","SM2","SM2 (20 MTHS)","Double (Type 1)","BCE"]
[null,null,null,"LIU CHANG","U1220491J","SM2","SM2 (20 MTHS)","Single","ME"]
[null,null,null,"XIE XIAN","U1220492F","SM2","SM2 (20 MTHS)","Single","ME"]
[null,null,null,"LI ZIYANG","U1220493C","SM3","SM2 (12MTHS)","Single","CE"]
[null,null,null,"XIAO LINGXI","U1220494L","SM2","SM2 (12MTHS)","Single","EEE"]
[null,null,null,"GONG YUE","U1220495H","SM3","SM2 (20 MTHS)","Single","CE"]
[null,null,null,"SHI ZEKUN","U1220496E","SM3","SM2 (20 MTHS)","Single","MATH"]
[null,null,null,"HE QUANQUAN","U1220497B","SM3","SM2 (12MTHS)","Single","CEE"]
[null,null,null,"PAN CHUJIE","U1220498K","SM3","SM2 (20 MTHS)","Single","EEE"]
[null,null,null,"SHENG LU","U1220499G","SM2","SM2 (20 MTHS)","Single","EEE"]
[null,null,null,"FENG CHAO","U1220500K","SM3","SM2 (20 MTHS)","Single","CSC"]
[null,null,null,"LI YUERAN","U1220501G","SM2","SM2 (20 MTHS)","Single","CE"]
[null,null,null,"SONG LIYANG","U1220502D","SM3","NA","Single","EEE"]
[null,null,null,"GAN JIAQING","U1220503A","SM2","SM2 (20 MTHS)","Single","EEE"]
[null,null,null,"ZHOU XINZI","U1220504J","SM3","SM2 (20 MTHS)","Single","CSC"]
[null,null,null,"TIAN YUJIA","U1220505F","SM3","SM2 (20 MTHS)","Single","EEE"]
[null,null,null,"WANG YINGXUAN","U1220506C","SM2","SM2 (12MTHS)","Single","EEE"]
[null,null,null,"XIA YU","U1220507L","SM2","SM2 (20 MTHS)","Single","CBE"]
[null,null,null,"LIU XUE","U1220508H","SM3","SM2 (20 MTHS)","Double (Type 1)","BCG"]
[null,null,null,"LI TINGTING","U1220509E","SM2","SM2 (20 MTHS)","Single","EEE"]
[null,null,null,"LI YUE","U1220511E","SM3","SM2 (12MTHS)","Single","EEE"]
[null,null,null,"ZHANG XINYUE","U1220512B","SM2","SM2 (12MTHS)","Single","EEE"]
[null,null,null,"GONG CHUNZHU","U1220514G","SM2","SM2 (20 MTHS)","Single","ME"]
[null,null,null,"WANG DIER","U1220515D","SM2","SM2 (12MTHS)",{"$f":"VLOOKUP(I$1:I$5281,$A$37:$B$212,2,FALSE)","v":"Single"},"BIE"]
[null,null,null,"NAN JIAYAN","U1220516A","SM2","SM2 (12MTHS)","Single","CBE"]
[null,null,null,"JIANG XINLAI","U1220517J","SM2","SM2 (20 MTHS)","Single","EEE"]
[null,null,null,"GUO HAO","U1220518F","SM3","SM2 (12MTHS)","Single","MS"]
[null,null,null,"YANG QIHUANG","U1220519C","SM2","SM2 (20 MTHS)","Single","CE"]
[null,null,null,"CHU BOWEN","U1220520F","SM2","SM2 (12MTHS)","Single","EEE"]
[null,null,null,"LU SHENGLIANG","U1220521C","SM3","SM2 (12MTHS)","Single","CE"]
[null,null,null,"ZHANG HAN","U1220522L","SM2","SM2 (12MTHS)","Double (Type 1)","BCG"]
[null,null,null,"HONG XIAOHUI","U1220523H","SM2","SM2 (12MTHS)","Single","CSC"]
[null,null,null,"FU HAO","U1220524E","SM3","SM2 (20 MTHS)","Single","EEE"]
[null,null,null,"LIN SHICONG","U1220525B","SM3","SM2 (20 MTHS)","Single","EEE"]
[null,null,null,"LU JIAHONG","U1220526K","SM2","SM2 (20 MTHS)","Single","IEM"]
[null,null,null,"JIANG HUAN","U1220527G","SM2","SM2 (20 MTHS)","Single","CE"]
[null,null,null,"LI XINGLIN","U1220528D","SM3","SM2 (20 MTHS)","Single","EEE"]
[null,null,null,"XU XIAOQIAN","U1220529A","SM3","SM2 (12MTHS)","Single","ENE"]
[null,null,null,"ZENG YE","U1220530D","SM2","SM2 (12MTHS)","Double (Type 1)","BCG"]
[null,null,null,"YAO XIBING","U1220531A","SM3","SM2 (20 MTHS)","Single","EEE"]
[null,null,null,"YE DAN","U1220532J","SM3","SM2 (20 MTHS)","Single","EEE"]
[null,null,null,"YANG RUNTONG","U1220534C","SM2","SM2 (20 MTHS)","Single","EEE"]
[null,null,null,"ZHAO YIDAN","U1220535L","SM2","SM2 (20 MTHS)","Single","EEE"]
[null,null,null,"ZHAO TIAN","U1220536H","SM2","SM2 (12MTHS)","Single","CEE"]
[null,null,null,"GENG XIAOLIANG","U1220537E","SM2","SM2 (12MTHS)","Single","MS"]
[null,null,null,"GUO YANCHUNNI","U1220538B","SM2","SM2 (20 MTHS)","Single","ME"]
[null,null,null,"GONG YIWEI","U1220539K","SM2","SM2 (20 MTHS)","Single","CSC"]
[null,null,null,"TANG DI","U1220540B","SM2","SM2 (20 MTHS)","Single","ENE"]
[null,null,null,"MAO HUIQI","U1220541K","SM2","SM2 (12MTHS)","Single","CSC"]
[null,null,null,"HAN BO","U1220542G","SM3","SM2 (20 MTHS)","Single","ME"]
[null,null,null,"CHE MAOHAO","U1220543D","SM2","SM2 (20 MTHS)","Single","CEE"]
[null,null,null,"XU XIAOHAN","U1220544A","SM3","SM2 (20 MTHS)","Single","BIE"]
[null,null,null,"LU MEIHONG","U1220545J","SM2","SM2 (12MTHS)","Single","EEE"]
[null,null,null,"ZHANG XU","U1220546F","SM3","SM2 (20 MTHS)","Single","EEE"]
[null,null,null,"ZHOU HANG","U1220547C","SM3","SM2 (20 MTHS)","Single","CEE"]
[null,null,null,"WANG QILIN","U1220548L","SM2","SM2 (12MTHS)","Single","CSC"]
[null,null,null,"LIN YAQI","U1220549H","SM2","SM2 (12MTHS)","Single","CBE"]
[null,null,null,"CHENG QIUWEN","U1220550L","SM2","SM2 (12MTHS)","Single","EEE"]
[null,null,null,"HU DONGLIN","U1220551H","SM2","SM2 (20 MTHS)","Single","EEE"]
[null,null,null,"ZHOU XIAN","U1220552E","SM2","SM2 (20 MTHS)","Single","ME"]
[null,null,null,"WANG SI","U1220553B","SM2","SM2 (12MTHS)","Single","EEE"]
[null,null,null,"FU XIANLEI","U1220554K","SM2","SM2 (20 MTHS)","Single","CEE"]
[null,null,null,"XIAO YAO","U1220555G","SM3","NA","Single","IEM"]
[null,null,null,"DENG LINGZHE","U1220556D","SM3","SM2 (12MTHS)","Single","EEE"]
[null,null,null,"YANG ZHAN","U1220557A","SM2","SM2 (20 MTHS)","Single","IEM"]
[null,null,null,"MAO FAN","U1220558J","SM3","SM2 (12MTHS)","Single","CEE"]
[null,null,null,"CHEN YANJUN","U1220559F","SM3","SM2 (20 MTHS)","Single","EEE"]
[null,null,null,"WANG YANG","U1220560J","SM2","SM2 (20 MTHS)","Single","BIE"]
[null,null,null,"BI RAN","U1220561F","SM2","SM2 (12MTHS)","Single","CSC"]
[null,null,null,"RONG FENGHE","U1220562C","SM3","SM2 (20 MTHS)","Single","EEE"]
[null,null,null,"PENG JIACHENG","U1220563L","SM2","SM2 (12MTHS)","Single","IEM"]
[null,null,null,"WANG HEWEN","U1220564H","SM3","SM2 (20 MTHS)","Single","EEE"]
[null,null,null,"CHENG TIANYUAN","U1220566B","SM2","SM2 (20 MTHS)","Single","CEE"]
[null,null,null,"CHEN WENJIE","U1220567K","SM3","SM2 (20 MTHS)","Double (Type 1)","BCG"]
[null,null,null,"ZHANG HANLIN","U1220568G","SM3","SM2 (20 MTHS)","Double (Type 1)","BCG"]
[null,null,null,"DU PANWEI","U1220570G","SM2","SM2 (12MTHS)","Single","CEE"]
[null,null,null,"ZHANG RONGGUANG","U1220571D","SM3","SM2 (12MTHS)","Single","EEE"]
[null,null,null,"ZHOU FENGYI","U1220572A","SM3","SM2 (12MTHS)","Single","CSC"]
[null,null,null,"WANG YUJIA","U1220573J","SM3","SM2 (20 MTHS)","Single","EEE"]
[null,null,null,"JIANG XUE","U1220574F","SM3","SM2 (20 MTHS)","Single","EEE"]
[null,null,null,"ZHU LINGJIE","U1220575C","SM3","SM2 (20 MTHS)","Single","CBE"]
[null,null,null,"HOU XIAO","U1220576L","SM2","SM2 (12MTHS)","Single","CEE"]
[null,null,null,"ZHAO XIWEI","U1220578E","SM3","SM2 (12MTHS)","Single","MS"]
[null,null,null,"SONG JIAYING","U1220579B","SM2","SM2 (20 MTHS)","Single","CSC"]
[null,null,null,"XIE YUSHAN","U1220580E","SM2","SM2 (20 MTHS)","Single","IEM"]
[null,null,null,"ZHANG TIANCHENG","U1220581B","SM3","SM2 (20 MTHS)","Single","ME"]
[null,null,null,"LIU CHENGQI","U1220582K","SM3","SM2 (12MTHS)","Single","EEE"]
[null,null,null,"ZHANG JIEWEN","U1220583G","SM2","SM2 (20 MTHS)",{"$f":"VLOOKUP(I$1:I$5281,$A$37:$B$212,2,FALSE)","v":"Single"},"EEE"]
[null,null,null,"YU HANXIAO","U1220586J","SM2","SM2 (20 MTHS)","Single","ME"]
[null,null,null,"GUO ZIXING","U1220587F","SM2","SM2 (20 MTHS)","Single","EEE"]
[null,null,null,"PANG YIPENG","U1220588C","SM2","SM2 (20 MTHS)","Single","EEE"]
[null,null,null,"ZHU JIAYU","U1220589L","SM2","SM2 (20 MTHS)","Single","EEE"]
[null,null,null,"CHENG HONGFEI","U1220590C","SM3","SM2 (20 MTHS)","Single","MAT"]
[null,null,null,"DUAN YAN","U1220591L","SM3","SM2 (20 MTHS)","Single","MAT"]
[null,null,null,"LIU WEIDE","U1220593E","SM3","SM2 (20 MTHS)","Single","EEE"]
[null,null,null,"WANG NAN","U1220594B","SM3","SM2 (20 MTHS)","Single","EEE"]
[null,null,null,"ZHANG TIANCI","U1220595K","SM2","SM2 (20 MTHS)","Single","ME"]
[null,null,null,"ZHANG QIAN","U1220596G","SM3","SM2 (20 MTHS)","Single","EEE"]
[null,null,null,"CHEN SHIQING","U1220597D","SM3","SM2 (20 MTHS)","Single","EEE"]
[null,null,null,"LI YICHANG","U1220598A","SM2","SM2 (20 MTHS)","Single","CSC"]
[null,null,null,"YANG YUN","U1220599J","SM2","SM2 (12MTHS)","Single","ME"]
[null,null,null,"DU JIAWEI","U1220600A","SM3","SM2 (12MTHS)","Single","EEE"]
[null,null,null,"CHEN LIYANG","U1220601J","SM3","SM2 (20 MTHS)","Single","CE"]
[null,null,null,"ZHANG JIAHENG","U1220602F","SM2","SM2 (20 MTHS)","Single","EEE"]
[null,null,null,"LU YIFENG","U1220603C","SM2","SM2 (20 MTHS)","Single","MAT"]
[null,null,null,"ZHOU XIAOCHI","U1220604L","SM2","SM2 (12MTHS)","Single","EEE"]
[null,null,null,"SUN XI","U1220605H","SM3","SM2 (20 MTHS)","Single","MS"]
[null,null,null,"ZHAO SHUAI","U1220606E","SM2","SM2 (20 MTHS)","Single","MAT"]
[null,null,null,"GU SIYU","U1220607B","SM2","SM2 (20 MTHS)","Single","ME"]
[null,null,null,"ZHAO HENG","U1220608K","SM2","SM2 (12MTHS)","Single","EEE"]
[null,null,null,"YIN TIANTIAN","U1220609G","SM2","SM2 (12MTHS)","Single","EEE"]
[null,null,null,"XU KE","U1220610K","SM2","SM2 (12MTHS)","Single","IEM"]
[null,null,null,"CHEN YUSHAN","U1220611G","SM2","SM2 (20 MTHS)","Single","EEE"]
[null,null,null,"ZHENG SHUANGYUE","U1220612D","SM2","SM2 (20 MTHS)","Single","EEE"]
[null,null,null,"WANG ZHE","U1220613A","SM3","SM2 (20 MTHS)","Single","EEE"]
[null,null,null,"WANG CHENGCHENG","U1220614J","SM3","SM2 (20 MTHS)","Single","ME"]
[null,null,null,"ZHOU LINLI","U1220615F","SM2","SM2 (20 MTHS)","Single","MAT"]
[null,null,null,"GUO SIKAI","U1220616C","SM2","SM2 (20 MTHS)","Single","CE"]
[null,null,null,"WANG ZIHAO","U1220617L","SM3","SM2 (20 MTHS)","Single","EEE"]
[null,null,null,"ZHANG WEILI","U1220618H","SM3","SM2 (20 MTHS)","Single","EEE"]
[null,null,null,"LI PENGFEI","U1220619E","SM2","SM2 (20 MTHS)","Single","EEE"]
[null,null,null,"QUAN LI","U1220620H","SM2","SM2 (12MTHS)","Single","EEE"]
[null,null,null,"LIU YANLING","U1220621E","SM3","SM2 (20 MTHS)","Single","EEE"]
[null,null,null,"ZENG YUWEI","U1220622B","SM3","SM2 (20 MTHS)","Single","EEE"]
[null,null,null,"MA LINLU","U1220623K","SM3","SM2 (20 MTHS)","Single","ME"]
[null,null,null,"HAN FENGZHI","U1220624G","SM3","SM2 (20 MTHS)","Single","MS"]
[null,null,null,"SUN ANZHI","U1220625D","SM2","SM2 (12MTHS)","Single","EEE"]
[null,null,null,"YIN YUWEI","U1220626A","SM2","SM2 (20 MTHS)","Single","MS"]
[null,null,null,"XU YAOHE","U1220627J","SM2","SM2 (20 MTHS)","Single","CSC"]
[null,null,null,"YANG WENJING","U1220630F","SM2","SM2 (12MTHS)","Single","ME"]
[null,null,null,"HAN BIHUI","U1220631C","SM2","SM2 (12MTHS)","Single","EEE"]
[null,null,null,"LIU JIAQI","U1220632L","SM2","SM2 (20 MTHS)","Single","ME"]
[null,null,null,"NIU HONGYU","U1220633H","SM3","SM2 (20 MTHS)","Single","ME"]
[null,null,null,"WANG RUCHEN","U1220634E","SM3","SM2 (12MTHS)","Single","EEE"]
[null,null,null,"GUO PENGSHENG","U1220635B","SM2","SM2 (12MTHS)","Single","ME"]
[null,null,null,"YAO PING","U1220637G","SM3","SM2 (20 MTHS)","Single","ME"]
[null,null,null,"ZHANG KEDI","U1220639A","SM2","SM2 (12MTHS)","Single","CBE"]
[null,null,null,"HE GUANGXU","U1220640D","SM2","SM2 (20 MTHS)","Single","EEE"]
[null,null,null,"ZHOU WENKANG","U1220641A","SM3","SM2 (12MTHS)","Single","EEE"]
[null,null,null,"WANG SHANCHENG","U1220642J","SM3","SM2 (12MTHS)","Single","MAT"]
[null,null,null,"YANG FENGYUAN","U1220643F","SM2","SM2 (20 MTHS)","Single","EEE"]
[null,null,null,"XU MENGXING","U1220644C","SM3","SM2 (20 MTHS)","Double (Type 1)","BCG"]
[null,null,null,"LAI TINGLIN","U1220645L","SM2","SM2 (20 MTHS)","Single","EEE"]
[null,null,null,"LV MO","U1220646H","SM2","SM2 (12MTHS)","Single","ME"]
[null,null,null,"HE YIZHOU","U1220647E","SM2","SM2 (20 MTHS)","Single","EEE"]
[null,null,null,"LIU SIQI","U1220648B","SM2","SM2 (12MTHS)","Single","EEE"]
[null,null,null,"ZHANG CHUQING","U1220649K","SM2","SM2 (12MTHS)","Single","CSC"]
[null,null,null,"LI YI","U1220650B","SM2","SM2 (20 MTHS)","Single","CBE"]
[null,null,null,"HAN JINGYAO","U1220651K","SM3","SM2 (20 MTHS)","Single","BS"]
[null,null,null,"PANG BO","U1220652G","SM2","SM2 (12MTHS)","Single","EEE"]
[null,null,null,"QIU HAI","U1220653D","SM3","SM2 (12MTHS)","Single","IEM"]
[null,null,null,"JIANG YAN","U1220654A","SM2","SM2 (20 MTHS)",{"$f":"VLOOKUP(I$1:I$5281,$A$37:$B$212,2,FALSE)","v":"Single"},"EEE"]
[null,null,null,"WEI JIAQI","U1220655J","SM2","SM2 (20 MTHS)","Single","MAT"]
[null,null,null,"XU HUA","U1220656F","SM3","SM2 (12MTHS)","Single","EEE"]
[null,null,null,"XING DA","U1220657C","SM3","SM2 (20 MTHS)","Single","EEE"]
[null,null,null,"SONG QIAOZHI","U1220659H","SM2","SM2 (20 MTHS)","Single","EEE"]
[null,null,null,"CAO HUIMIN","U1220660L","SM3","SM2 (12MTHS)","Single","EEE"]
[null,null,null,"MA JIAMENG","U1220661H","SM3","SM2 (20 MTHS)","Single","EEE"]
[null,null,null,"CHEN JINGWEI","U1220662E","SM2","SM2 (20 MTHS)","Single","EEE"]
[null,null,null,"SHI YUTING","U1220663B","SM2","SM2 (12MTHS)","Single","CBE"]
[null,null,null,"DONG LI","U1220664K","SM2","SM2 (20 MTHS)","Single","EEE"]
[null,null,null,"XIAO DI","U1220665G","SM2","SM2 (20 MTHS)","Single","EEE"]
[null,null,null,"ZHU LINGFEI","U1220666D","SM3","SM2 (20 MTHS)","Single","ME"]
[null,null,null,"LI PENGFEI","U1220667A","SM3","SM2 (20 MTHS)","Double (Type 1)","BCG"]
[null,null,null,"ZHANG YUWEN","U1220668J","SM2","SM2 (12MTHS)","Single","CEE"]
[null,null,null,"ZHONG SAILIN","U1220669F","SM3","SM2 (20 MTHS)","Single","IEM"]
[null,null,null,"GUO JIACHUN","U1220670J","SM3","SM2 (20 MTHS)","Single","CSC"]
[null,null,null,"WU JIAQI","U1220671F","SM2","SM2 (20 MTHS)","Single","EEE"]
[null,null,null,"PAN YUXING","U1220672C","SM2","SM2 (20 MTHS)","Single","EEE"]
[null,null,null,"LIU RUNSHENG","U1220673L","SM2","SM2 (20 MTHS)","Single","CSC"]
[null,null,null,"YANG JINGYI","U1220674H","SM2","SM2 (20 MTHS)","Single","AERO"]
[null,null,null,"WANG YIBO","U1220676B","SM2","SM2 (12MTHS)","Single","EEE"]
[null,null,null,"ZHONG PEIXIANG","U1220677K","SM3","SM2 (20 MTHS)","Single","EEE"]
[null,null,null,"ZHANG XINYUE","U1220678G","SM2","SM2 (20 MTHS)","Single","EEE"]
[null,null,null,"ZHANG YUFEI","U1220679D","SM3","SM2 (20 MTHS)","Single","EEE"]
[null,null,null,"FANG LINA","U1220680G","SM2","SM2 (12MTHS)","Single","IEM"]
[null,null,null,"ZHANG XIAOKUN","U1220681D","SM2","SM2 (20 MTHS)","Single","CSC"]
[null,null,null,"QI YIRU","U1220682A","SM2","SM2 (20 MTHS)","Double (Type 1)","BCG"]
[null,null,null,"SHI MENGJIE","U1220683J","SM3","SM2 (20 MTHS)","Single","EEE"]
[null,null,null,"ZHANG JIAQI","U1220684F","SM3","SM2 (12MTHS)","Single","EEE"]
[null,null,null,"ZHOU AO","U1220685C","SM2","SM2 (20 MTHS)","Single","EEE"]
[null,null,null,"LI XIANG","U1220686L","SM2","SM2 (20 MTHS)","Single","IEM"]
[null,null,null,"QI BOYAN","U1220687H","SM2","SM2 (20 MTHS)","Single","IEM"]
[null,null,null,"WANG ZHIZHENG","U1220688E","SM2","SM2 (20 MTHS)","Single","EEE"]
[null,null,null,"BAO JIAXIN","U1220690E","SM2","SM2 (20 MTHS)","Single","CEE"]
[null,null,null,"LIU LU","U1220691B","SM3","SM2 (20 MTHS)","Single","ME"]
[null,null,null,"MI YUE","U1220692K","SM3","SM2 (12MTHS)","Single","MS"]
[null,null,null,"HE TONG","U1220693G","SM2","SM2 (20 MTHS)","Single","EEE"]
[null,null,null,"ZHANG GANLU","U1220695A","SM3","SM2 (20 MTHS)","Single","MAT"]
[null,null,null,"WANG XIAOYING","U1220696J","SM2","SM2 (12MTHS)","Single","EEE"]
[null,null,null,"SU JING","U1220697F","SM3","SM2 (20 MTHS)","Single","MAT"]
[null,null,null,"YANG WEITAO","U1220698C","SM3","SM2 (20 MTHS)","Single","EEE"]
[null,null,null,"ZHANG SHAOCONG","U1220699L","SM2","SM2 (20 MTHS)","Single","IEM"]
[null,null,null,"XIE CHENTAO","U1220700C","SM2","SM2 (20 MTHS)","Single","MS"]
[null,null,null,"LU SHUANGLING","U1220701L","SM3","SM2 (20 MTHS)","Single","ME"]
[null,null,null,"ZHANG LIAN","U1220704B","SM2","SM2 (20 MTHS)","Single","EEE"]
[null,null,null,"ZHAI LIZHU","U1220705K","SM2","SM2 (20 MTHS)","Single","EEE"]
[null,null,null,"JIANG YUSHAN","U1220706G","SM3","SM2 (20 MTHS)","Single","EEE"]
[null,null,null,"ZOU YUAN","U1220707D","SM2","SM2 (20 MTHS)","Single","EEE"]
[null,null,null,"JIANG FANGYUAN","U1220708A","SM3","SM2 (20 MTHS)","Single","EEE"]
[null,null,null,"GUO YUWEI","U1220710A","SM3","SM2 (20 MTHS)","Single","MAT"]
[null,null,null,"HU MENGJIAO","U1220711J","SM3","SM2 (12MTHS)","Single","EEE"]
[null,null,null,"ZHANG SHUYU","U1220712F","SM3","SM2 (12MTHS)","Single","MAT"]
[null,null,null,"PENG LUNAN","U1220713C","SM3","SM2 (20 MTHS)","Single","CE"]
[null,null,null,"WEI XU","U1220714L","SM3","SM2 (20 MTHS)","Single","EEE"]
[null,null,null,"GUO MINGZHE","U1220715H","SM3","SM2 (20 MTHS)","Single","EEE"]
[null,null,null,"JI TETE","U1220716E","SM3","SM2 (20 MTHS)","Single","EEE"]
[null,null,null,"GUO JIA","U1220717B","SM3","SM2 (20 MTHS)","Single","MAT"]
[null,null,null,"XIAO QUN","U1220718K","SM3","SM2 (12MTHS)","Single","EEE"]
[null,null,null,"WANG PENGFEI","U1220719G","SM2","SM2 (20 MTHS)","Single","MS"]
[null,null,null,"LI XINTONG","U1220721G","SM3","SM2 (20 MTHS)","Single","EEE"]
[null,null,null,"WANG XING","U1220723A","SM3","SM2 (20 MTHS)","Single","EEE"]
[null,null,null,"CHEN BOMING","U1220725F","SM3","SM2 (12MTHS)","Single","EEE"]
[null,null,null,"LIU JIALIN","U1220726C","SM2","SM2 (20 MTHS)","Single","CEE"]
[null,null,null,"LU YOU","U1220727L","SM2","SM2 (20 MTHS)","Single","CSC"]
[null,null,null,"WANG ZHIXIANG","U1220728H","SM3","SM2 (12MTHS)",{"$f":"VLOOKUP(I$1:I$5281,$A$37:$B$212,2,FALSE)","v":"Single"},"EEE"]
[null,null,null,"MA LIN","U1220729E","SM3","SM2 (20 MTHS)","Single","EEE"]
[null,null,null,"KUANG YIMING","U1220730H","SM2","SM2 (20 MTHS)","Single","EEE"]
[null,null,null,"LIU CONG","U1220732B","SM3","SM2 (20 MTHS)","Single","EEE"]
[null,null,null,"DONG KUICAI","U1220733K","SM3","SM2 (12MTHS)","Single","EEE"]
[null,null,null,"WANG ZHIHAO","U1220734G","SM3","SM2 (12MTHS)","Single","IEM"]
[null,null,null,"GAO JIANAN","U1220735D","SM2","SM2 (20 MTHS)","Single","CSC"]
[null,null,null,"ZHOU ANNA","U1220736A","SM3","SM2 (12 MTHS)","Single","EEE"]
[null,null,null,"SUN SHENGMEI","U1220737J","SM3","SM2 (12 MTHS)","Single","MS"]
[null,null,null,"GUAN XINZI","U1220739C","SM3","SM2 (20 MTHS)","Single","ME"]
[null,null,null,"TANG YUN","U1220740F","SM3","SM2 (20 MTHS)","Single","EEE"]
[null,null,null,"XU JUNHUI","U1220741C","SM2","SM2 (20 MTHS)","Single","CBE"]
[null,null,null,"WANG QIJIA","U1220742L","SM2","SM2 (12 MTHS)","Single","EEE"]
[null,null,null,"ZENG ZHE","U1220743H","SM2","SM2 (20 MTHS)","Single","EEE"]
[null,null,null,"HUANG HANGYU","U1220744E","SM2","SM2 (20 MTHS)","Single","CEE"]
[null,null,null,"SHAO TIANJI","U1220745B","SM2","SM2 (12 MTHS)","Single","EEE"]
[null,null,null,"GONG MINGYI","U1220746K","SM2","SM2 (20 MTHS)","Single","CE"]
[null,null,null,"WANG HAN","U1220747G","SM3","SM2 (12 MTHS)","Single","EEE"]
[null,null,null,"WANG YI","U1220748D","SM2","SM2 (20 MTHS)","Single","CEE"]
[null,null,null,"CHENG DERUO","U1220749A","SM3","SM2 (12 MTHS)","Single","EEE"]
[null,null,null,"SU YU","U1220750D","SM3","SM2 (12 MTHS)","Single","EEE"]
[null,null,null,"ZHANG CHAO","U1220752J","SM2","SM2 (12 MTHS)","Single","EEE"]
[null,null,null,"QIN JINJIAO","U1220753F","SM3","SM2 (20 MTHS)","Single","EEE"]
[null,null,null,"LI YANNING","U1220754C","SM3","SM2 (20 MTHS)","Single","EEE"]
[null,null,null,"TAN YONGCHEN","U1220756H","SM2","SM2 (12 MTHS)","Single","ME"]
[null,null,null,"LUO GUAN","U1220757E","SM2","SM2 (12 MTHS)","Single","EEE"]
[null,null,null,"ZHANG LIANGLIANG","U1220758B","SM2","SM2 (12 MTHS)","Single","CSC"]
[null,null,null,"DU HAO","U1220759K","SM3","SM2 (12 MTHS)","Single","EEE"]
[null,null,null,"XIONG JUNYI","U1220760B","SM2","SM2 (12 MTHS)","Single","EEE"]
[null,null,null,"LI SHUFAN","U1220761K","SM2","SM2 (12 MTHS)","Single","EEE"]
[null,null,null,"LUO YIFEI","U1220762G","SM2","SM2 (20 MTHS)","Single","MAT"]
[null,null,null,"ZHANG QIANRU","U1220763D","SM2","SM2 (12 MTHS)","Single","EEE"]
[null,null,null,"LONG HONGQUAN","U1220764A","SM2","SM2 (12 MTHS)","Single","CSC"]
[null,null,null,"LIU TIANGE","U1220765J","SM2","SM2 (12 MTHS)","Single","EEE"]
[null,null,null,"DING SHUYA","U1220766F","SM3","SM2 (20 MTHS)","Single","EEE"]
[null,null,null,"XIAO QIANRU","U1220767C","SM2","SM2 (20 MTHS)","Double (Type 1)","BCG"]
[null,null,null,"GUO JINTAO","U1220768L","SM3","SM2 (12 MTHS)","Single","CSC"]
[null,null,null,"LIU YIKUN","U1220769H","SM2","SM2 (12 MTHS)","Double (Type 1)","BCG"]
[null,null,null,"LIU YIJING","U1220770L","SM2","SM2 (20 MTHS)","Single","IEM"]
[null,null,null,"WANG NI","U1220771H","SM3","SM2 (12 MTHS)","Single","ME"]
[null,null,null,"LI JIA","U1220772E","SM2","SM2 (20 MTHS)","Single","ME"]
[null,null,null,"GOU TONG","U1220773B","SM2","SM2 (12 MTHS)","Single","CSC"]
[null,null,null,"ZENG BO","U1220774K","SM2","SM2 (12 MTHS)","Single","EEE"]
[null,null,null,"LUO JIAWEN","U1220775G","SM2","SM2 (20 MTHS)","Single","EEE"]
[null,null,null,"KANG MENGLIN","U1220776D","SM2","SM2 (20 MTHS)","Single","EEE"]
[null,null,null,"HAN XINYU","U1220777A","SM2","SM2 (12 MTHS)","Single","EEE"]
[null,null,null,"GAN WEI","U1220778J","SM2","SM2 (20 MTHS)","Single","EEE"]
[null,null,null,"XING YULI","U1220780J","SM2","SM2 (12 MTHS)","Single","CBE"]
[null,null,null,"CAO YU","U1220783L","SM3","SM2 (12 MTHS)","Single","CEE"]
[null,null,null,"JIN LEI","U1220784H","SM2","SM2 (20 MTHS)","Single","EEE"]
[null,null,null,"XU YUDONG","U1220785E","SM2","SM2 (20 MTHS)","Single","EEE"]
[null,null,null,"LI HONGXI","U1220786B","SM2","SM2 (12 MTHS)","Single","IEM"]
[null,null,null,"CAO YUN","U1220787K","SM3","SM2 (20 MTHS)","Single","ME"]
[null,null,null,"XIE JIECHENG","U1220788G","SM3","SM2 (12 MTHS)","Single","EEE"]
[null,null,null,"JI LIN","U1220789D","SM3","SM2 (20 MTHS)","Single","MAT"]
[null,null,null,"HE XINYAN","U1220790G","SM2","SM2 (12 MTHS)","Single","MAT"]
[null,null,null,"QIU TIAN","U1220791D","SM2","SM2 (12 MTHS)","Single","EEE"]
[null,null,null,"LAN XIN","U1220792A","SM3","SM2 (20 MTHS)","Single","MAT"]
[null,null,null,"HONG ZHILIN","U1220793J","SM2","SM2 (20 MTHS)","Single","CEE"]
[null,null,null,"WU YUFENGNING","U1220794F","SM3","SM2 (12 MTHS)","Single","EEE"]
[null,null,null,"QING YUANYUAN","U1220795C","SM2","SM2 (12 MTHS)","Single","EEE"]
[null,null,null,"CHEN TIANQI","U1220796L","SM3","SM2 (20 MTHS)","Single","EEE"]
[null,null,null,"YANG XIAOFENG","U1220797H","SM3","SM2 (12 MTHS)","Single","EEE"]
[null,null,null,"ZHANG LINGZI","U1220798E","SM3","SM2 (12 MTHS)","Single","EEE"]
[null,null,null,"YANG ZIHE","U1220799B","SM3","SM2 (12 MTHS)",{"$f":"VLOOKUP(I$1:I$5281,$A$37:$B$212,2,FALSE)","v":"Single"},"CSC"]
[null,null,null,"SUN LIXING","U1220800E","SM2","SM2 (12 MTHS)","Single","EEE"]
[null,null,null,"LIU ZHAOYING","U1220801B","SM2","SM2 (12 MTHS)","Single","EEE"]
[null,null,null,"SONG CHENGWEI","U1220802K","SM2","SM2 (12 MTHS)","Single","CEE"]
[null,null,null,"LIU FAN","U1220803G","SM3","SM2 (12 MTHS)","Single","IEM"]
[null,null,null,"YAN WENDING","U1220804D","SM2","SM2 (12 MTHS)","Single","EEE"]
[null,null,null,"WANG ZIRUI","U1220805A","SM2","SM2 (20 MTHS)","Single","EEE"]
[null,null,null,"MENG YUAN","U1220806J","SM2","SM2 (20 MTHS)","Single","EEE"]
[null,null,null,"WANG RUI","U1220807F","SM2","SM2 (12 MTHS)","Single","EEE"]
[null,null,null,"LI ZIXUAN","U1220808C","SM2","SM2 (12 MTHS)","Double (Type 1)","BCE"]
[null,null,null,"LU MINGRUI","U1220809L","SM2","SM2 (20 MTHS)","Single","IEM"]
[null,null,null,"YU QING","U1220810C","SM2","SM2 (12 MTHS)","Single","ME"]
[null,null,null,"ZHU XIAOYI","U1220811L","SM2","SM2 (20 MTHS)","Single","IEM"]
[null,null,null,"GONG WENCHEN","U1220812H","SM2","SM2 (12 MTHS)","Single","CSC"]
[null,null,null,"LI XIAOYANG","U1220813E","SM2","SM2 (12 MTHS)","Single","ME"]
[null,null,null,"LI GAOFENG","U1220814B","SM2","SM2 (12 MTHS)","Single","CSC"]
[null,null,null,"WANG DINGCHENG","U1220815K","SM3","SM2 (12 MTHS)","Single","CE"]
[null,null,null,"RUAN PINGCHENG","U1220816G","SM2","SM2 (12 MTHS)","Single","CSC"]
[null,null,null,"BI RAN","U1220817D","SM3","SM2 (12 MTHS)","Single","EEE"]
[null,null,null,"BAI JING","U1220818A","SM3","SM2 (20 MTHS)","Single","ME"]
[null,null,null,"WAN YUAN","U1220819J","SM2","SM2 (20 MTHS)","Single","EEE"]
[null,null,null,"HUANG WEIKANG","U1220820A","SM2","SM2 (20 MTHS)","Single","CEE"]
[null,null,null,"LI ZHILING","U1220821J","SM2","SM2 (12 MTHS)","Single","CSC"]
[null,null,null,"LIU ZHANQI","U1220822F","SM2","SM2 (12 MTHS)","Single","CSC"]
[null,null,null,"XU CHONG","U1220823C","SM2","SM2 (20 MTHS)","Single","CSC"]
[null,null,null,"YUAN JIAXIU","U1220824L","SM2","SM2 (12 MTHS)","Single","ME"]
[null,null,null,"PANG JIMING","U1220825H","SM2","SM2 (20 MTHS)","Single","CBE"]
[null,null,null,"LIU YANG","U1220826E","SM3","SM2 (20 MTHS)","Single","EEE"]
[null,null,null,"LI YISHAN","U1220827B","SM2","SM2 (12 MTHS)","Single","CSC"]
[null,null,null,"CHEN JIAQI","U1220829G","SM2","SM2 (20 MTHS)","Double (Type 1)","BCG"]
[null,null,null,"WANG YUYING","U1220830K","SM3","SM2 (12 MTHS)","Single","CEE"]
[null,null,null,"GUO HANGKE","U1220831G","SM3","SM2 (20 MTHS)","Single","EEE"]
[null,null,null,"HE CHAOYUE","U1220832D","SM3","SM2 (20 MTHS)","Single","EEE"]
[null,null,null,"DING BOSHENG","U1220833A","SM3","SM2 (20 MTHS)","Single","EEE"]
[null,null,null,"XU YUNZE","U1220834J","SM2","SM2 (20 MTHS)","Single","CSC"]
[null,null,null,"ZHAO ZIXIAO","U1220835F","SM2","SM2 (20 MTHS)","Single","CE"]
[null,null,null,"LIU XUHAN","U1220836C","SM2","SM2 (12 MTHS)","Single","EEE"]
[null,null,null,"DI BOYU","U1220837L","SM3","SM2 (20 MTHS)","Single","ME"]
[null,null,null,"GUO DONGLIN","U1220838H","SM2","SM2 (20 MTHS)","Single","ME"]
[null,null,null,"QUE YANGHUA","U1220839E","SM2","SM2 (12 MTHS)","Single","CSC"]
[null,null,null,"ZHANG JIANI","U1220840H","SM2","SM2 (12 MTHS)","Single","EEE"]
[null,null,null,"JU JUNCHONG","U1220841E","SM2","SM2 (12 MTHS)","Single","ME"]
[null,null,null,"YUE MINKANG","U1220842B","SM2","SM2 (12 MTHS)","Single","CSC"]
[null,null,null,"ZHAO YUE","U1220844G","SM2","SM2 (12 MTHS)","Single","AERO"]
[null,null,null,"MA JIAHENG","U1220845D","SM2","SM2 (12 MTHS)","Single","EEE"]
[null,null,null,"GAO HE","U1220847J","SM2","SM2 (12 MTHS)","Single","CE"]
[null,null,null,"JIANG KEWEI","U1220848F","SM2","SM2 (20 MTHS)","Single","CSC"]
[null,null,null,"HUANG SHENRAN","U1220850F","SM2","SM2 (12 MTHS)","Single","EEE"]
[null,null,null,"LI YINGNAN","U1220851C","SM3","SM2 (12 MTHS)","Single","EEE"]
[null,null,null,"YANG YANG","U1220852L","SM2","SM2 (12 MTHS)","Single","ME"]
[null,null,null,"QIN SHUHAN","U1220880L","MOE PreU Scholar (PRC)","SM2 (12 MTHS)","Single","CBE"]
[null,null,null,"CALVIN WIRATAMA","U1220896B",null,"SM2 (12 MTHS)","Double (Type 2)","CBEC"]
[null,null,null,"LU QI","U1220898G","MOE PreU Scholar (PRC)","SM2 (12 MTHS)","Single","MAT"]
[null,null,null,"YE ZHONGYU","U1220908E","MOE PreU Scholar (PRC)","SM2 (12 MTHS)","Single","MS"]
[null,null,null,"CHEN PAI","U1220982G","MOE PreU Scholar (PRC)","SM2 (12 MTHS)","Single","AERO"]
[null,null,null,"ZHANG CHEN","U1220987C","MOE PreU Scholar (PRC)","SM2 (12 MTHS)","Double (Type 1)","BCE"]
[null,null,null,"MALAVIYA CHAITANYA","U1221016E",null,"SM2 (20 MTHS)","Single","CE"]
[null,null,null,"CHEN RONGFEN","U1221054C","MOE PreU Scholar (PRC)","SM2 (12 MTHS)","Single","ENE"]
[null,null,null,"LI XIAODONG","U1221061K","MOE PreU Scholar (PRC)","SM2 (12 MTHS)","Single","CBE"]
[null,null,null,"LI YAO","U1221088G","MOE PreU Scholar (PRC)","SM2 (12 MTHS)","Single","EEE"]
[null,null,null,"HUANG TING-YI","U1221123C","MOE PreU Scholar (PRC)","SM2 (12 MTHS)","Single","CBE"]
[null,null,null,"CHEN PENG","U1221188J","MOE PreU Scholar (PRC)","SM2 (12 MTHS)","Single","CSC"]
[null,null,null,"XU JIANXING","U1221306B","MOE PreU Scholar (PRC)","SM2 (12 MTHS)","Single","MS"]
[null,null,null,"SHEN BOWEN","U1221934C","MOE PreU Scholar (PRC)","SM2 (20 MTHS)","Double (Type 2)","IEEC"]
[null,null,null,"ZHANG AO","U1222006K","MOE PreU Scholar (PRC)","SM2 (12 MTHS)",{"$f":"VLOOKUP(I$1:I$5281,$A$37:$B$212,2,FALSE)","v":"Single"},"IEM"]
[null,null,null,"VIJAYENDIRAN AKSHAY","U1222655D","","SM2 (12 MTHS)","Single","ME"]
[null,null,null,"KAPOOR ADITYA","U1222747B",null,"SM2 (20 MTHS)","Single","ME"]
[null,null,null,"RAYMOND TANADI","U1240050J","Direct (Indo SMA UAN)","SM2 (20 MTHS)","Single","MATH"]
[null,null,null,"ADRIAN PRAYOGA","U1240052C","Direct (Indo SMA UAN)","SM2 (12 MTHS)","Single","MATH"]
[null,null,null,"DHIKA ADITYA GANDAMANA","U1240054H","Direct (Indo SMA UAN)","SM2 (12 MTHS)","Single","CHEM"]
[null,null,null,"NURUL AULIA","U1240057K","Direct (Indo SMA UAN)","SM2 (20 MTHS)","Single","CHEM"]
[null,null,null,"HAN FEI","U1240102D","SM2","SM2 (12 MTHS)","Single","CHEM"]
[null,null,null,"CUI XIAOYANG","U1240103A","SM2","SM2 (12 MTHS)","Single","PHY"]
[null,null,null,"LIN WENYI","U1240104J","SM2","SM2 (12 MTHS)","Single","MAEC"]
[null,null,null,"WANG XINYI","U1240105F","SM2","SM2 (12 MTHS)","Single","MATH"]
[null,null,null,"TIAN YUAN","U1240106C","SM2","SM2 (20 MTHS)","Single","MATH"]
[null,null,null,"WANG FAN","U1240107L","SM2","SM2 (12 MTHS)","Single","MATH"]
[null,null,null,"WANG DANLEI","U1240108H","SM2","SM2 (12 MTHS)","Single","BS"]
[null,null,null,"ZHAO YUNYI","U1240109E","SM2","SM2 (20 MTHS)","Single","MAEC"]
[null,null,null,"LI LISHA","U1240110H","SM2","SM2 (12 MTHS)","Single","MATH"]
[null,null,null,"WANG NAN","U1240111E","SM2","SM2 (20 MTHS)","Single","MATH"]
[null,null,null,"CHEN XILIN","U1240112B","SM2","SM2 (12 MTHS)","Single","MATH"]
[null,null,null,"HE JINYI","U1240113K","SM2","SM2 (20 MTHS)","Single","BS"]
[null,null,null,"HU ZEHUI","U1240114G","SM2","SM2 (20 MTHS)","Single","MAEC"]
[null,null,null,"YANG YI","U1240116A","SM2","SM2 (20 MTHS)","Single","MAEC"]
[null,null,null,"ZHEN YASHU","U1240117J","SM2","SM2 (20 MTHS)","Single","BS"]
[null,null,null,"HE BO","U1240118F","SM2","SM2 (12 MTHS)","Single","MATH"]
[null,null,null,"LIU JUNWEI","U1240119C","SM3","SM2 (12 MTHS)","Single","BS"]
[null,null,null,"JIANG HONGXU","U1240120F","SM3","SM2 (12 MTHS)","Single","MAEC"]
[null,null,null,"HONG CHENZHI","U1240121C","SM2","SM2 (12 MTHS)","Single","MATH"]
[null,null,null,"CHEN JIAJING","U1240122L","SM2","SM2 (12 MTHS)","Single","MAEC"]
[null,null,null,"ZHENG RULAN","U1240123H","SM2","SM2 (20 MTHS)","Single","MAEC"]
[null,null,null,"CHEN JIAXING","U1240124E","SM2","SM2 (12 MTHS)","Single","MATH"]
[null,null,null,"ZHOU YINAN","U1240125B","SM2","SM2 (20 MTHS)","Single","MATH"]
[null,null,null,"DU WENJING","U1240126K","SM2","SM2 (12 MTHS)","Single","MATH"]
[null,null,null,"LONG ZIJIE","U1240127G","SM2","SM2 (12 MTHS)","Single","MAEC"]
[null,null,null,"CHEN YUFEI","U1240128D","SM3","SM2 (12 MTHS)","Single","MAEC"]
[null,null,null,"TANG HAN","U1240129A","SM2","SM2 (12 MTHS)","Single","MATH"]
[null,null,null,"MA XIAOXUE","U1240130D","SM2","SM2 (20 MTHS)","Single","CSC"]
[null,null,null,"CHEN ZHUO","U1240131A","SM2","SM2 (12 MTHS)","Single","MAEC"]
[null,null,null,"WEN HAOYU","U1240132J","SM2","SM2 (12 MTHS)","Single","PHY"]
[null,null,null,"SUN CHENYU","U1240133F","SM2","SM2 (20 MTHS)","Single","MAEC"]
[null,null,null,"ZONG JINGJING","U1240134C","SM2","SM2 (20 MTHS)","Single","MATH"]
[null,null,null,"XUAN JINGZHE","U1240135L","SM3","SM2 (20 MTHS)","Single","MATH"]
[null,null,null,"CHEN XINYUE","U1240136H","SM2","SM2 (12 MTHS)","Single","MATH"]
[null,null,null,"HUANG YING","U1240137E","SM2","SM2 (12 MTHS)","Single","MAEC"]
[null,null,null,"WANG TONG","U1240138B","SM3","SM2 (12 MTHS)","Single","MAEC"]
[null,null,null,"CHEN ZIWEN","U1240139K","SM2","SM2 (12 MTHS)","Single","MAEC"]
[null,null,null,"SUN HAIYANG","U1240140B","SM2","SM2 (20 MTHS)","Single","MAEC"]
[null,null,null,"LEI YISHENG","U1240141K","SM3","SM2 (12 MTHS)","Single","PHY"]
[null,null,null,"GUO AOXIN","U1240142G","SM3","SM2 (12 MTHS)","Single","CHEM"]
[null,null,null,"SWETHA SRIDHAR","U1240178E","","SM2 (12 MTHS)","Single","PHY"]
[null,null,null,"ARYANI PARAMITA","U1320056A",null,"NA","Single","CSC"]
[null,null,null,"CALVIN TANUDJAJA","U1320064E",null,"SM2 (20 MTHS)","Single","ME"]
[null,null,null,"HANZEL HARTLEY LALITAN","U1320071A",null,"SM2 (12 MTHS)","Single","ENE"]
[null,null,null,"BRIGITTA RACHEL","U1320080B",null,"SM2 (12 MTHS)","Single","ME"]
[null,null,null,"ALDI STEFANUS FELIM","U1320089H",null,"SM2 (20 MTHS)","Single","CBE"]
[null,null,null,"JOSHUA CHRISTIAN NATHANAEL","U1320096D",null,"SM2 (12 MTHS)","Single","AERO"]
[null,null,null,"JOSHUA ARISTO NATHANIEL","U1320103L",null,"SM2 (20 MTHS)","Single","CSC"]
[null,null,null,"LINIKI","U1320115C",null,"SM2 (12 MTHS)","Single","CSC"]
[null,null,null,"REINALDO MASLIM","U1320121B",null,"SM2 (20 MTHS)","Single","ME"]
[null,null,null,"EVANDO","U1320145H",null,"SM2 (12 MTHS)","Single","CBE"]
[null,null,null,"THEODORA KARIN DHARMANTO","U1320147B",null,"SM2 (12 MTHS)","Single","MAT"]
[null,null,null,"HANDOKO","U1320148K",null,"SM2 (12 MTHS)","Single","CEE"]
[null,null,null,"MARIO INDRA SANDI","U1320154J",null,"SM2 (12 MTHS)","Single","MAT"]
[null,null,null,"ANDRI RENARDI LAUW","U1320155F",null,"SM2 (20 MTHS)","Single","EEE"]
[null,null,null,"I MADE WISWA NARADHA","U1320157L",null,"SM2 (12 MTHS)","Single","EEE"]
[null,null,null,"LUVITA SURYANI","U1320160H",null,"SM2 (12 MTHS)","Single","BIE"]
[null,null,null,"HARTONO WIJAYA","U1320169C",null,"SM2 (12 MTHS)",{"$f":"VLOOKUP(I$1:I$5281,$A$37:$B$212,2,FALSE)","v":"Single"},"CBE"]
[null,null,null,"WANG CHEN","U1320491E","SM2","SM2 (20 MTHS)","Single","EEE"]
[null,null,null,"ZHENG ZESHENG","U1320492B","SM2","SM2 (20 MTHS)","Single","EEE"]
[null,null,null,"CHANG RONGJIA","U1320493K","SM2","SM2 (20 MTHS)","Single","CE"]
[null,null,null,"SONG XINZE","U1320496A","SM2","SM2 (12 MTHS)","Single","EEE"]
[null,null,null,"ZHOU CHENGZHI","U1320497J","SM2","SM2 (12 MTHS)","Single","MAT"]
[null,null,null,"DONG MENGXIN","U1320498F","SM2","SM2 (20 MTHS)","Single","IEM"]
[null,null,null,"CHEN NINGSHUANG","U1320499C","SM2","SM2 (12 MTHS)","Double (Type 1)","BCE"]
[null,null,null,"SHE YANYAO","U1320501C","SM2","SM2 (12 MTHS)","Single","IEM"]
[null,null,null,"ZHAO XURAN","U1320504E","SM2","SM2 (12 MTHS)","Single","ME"]
[null,null,null,"LI PEIMAN","U1320505B","SM2","SM2 (20 MTHS)","Single","CEE"]
[null,null,null,"CHEN ZHE","U1320506K","SM2","SM2 (12 MTHS)","Double (Type 1)","BCE"]
[null,null,null,"YAN HONGXU","U1320508D","SM2","SM2 (12 MTHS)","Single","CSC"]
[null,null,null,"CHEN CHUNYUN","U1320509A","SM2","SM2 (20 MTHS)","Single","CEE"]
[null,null,null,"ZHU SIYING","U1320511A","SM2","SM2 (20 MTHS)","Single","MS"]
[null,null,null,"ZHANG SHUO","U1320512J","SM2","SM2 (20 MTHS)","Single","EEE"]
[null,null,null,"ZHOU XINRAN","U1320514C","SM2","SM2 (12 MTHS)","Single","MAT"]
[null,null,null,"SHANG YUXIN","U1320515L","SM2","SM2 (12 MTHS)","Single","EEE"]
[null,null,null,"YE JIATONG","U1320516H","SM2","SM2 (12 MTHS)","Single","EEE"]
[null,null,null,"MA LAN","U1320517E","SM2","SM2 (12 MTHS)","Single","EEE"]
[null,null,null,"ZHANG WANXUAN","U1320518B","SM2","SM2 (12 MTHS)","Single","EEE"]
[null,null,null,"LI CHUQIAO","U1320519K","SM2","SM2 (12 MTHS)","Double (Type 1)","BCG"]
[null,null,null,"XIE YUAN","U1320520B","SM2","SM2 (12 MTHS)","Single","AERO"]
[null,null,null,"LIU JIALIANG","U1320521K","SM2","SM2 (20 MTHS)","Single","MS"]
[null,null,null,"GUO XINRUI","U1320522G","SM2","SM2 (20 MTHS)","Single","CEE"]
[null,null,null,"HUANG SHANG","U1320523D","SM2","SM2 (20 MTHS)","Single","CBE"]
[null,null,null,"SUN QIAN","U1320524A","SM2","SM2 (12 MTHS)","Single","CEE"]
[null,null,null,"LING CHEN","U1320526F","SM2","SM2 (12 MTHS)","Single","EEE"]
[null,null,null,"WANG JINGYI","U1320527C","SM2","SM2 (12 MTHS)","Single","IEM"]
[null,null,null,"SHI MENGQI","U1320528L","SM2","SM2 (20 MTHS)","Single","MS"]
[null,null,null,"YANG JIAN","U1320529H","SM2","SM2 (20 MTHS)","Single","EEE"]
[null,null,null,"YANG QIAOYU","U1320530L","SM2","SM2 (12 MTHS)","Single","EEE"]
[null,null,null,"ZHAO DONGYU","U1320532E","SM2","SM2 (12 MTHS)","Single","CEE"]
[null,null,null,"XUE CHUHUI","U1320533B","SM2","SM2 (20 MTHS)","Single","CE"]
[null,null,null,"JIN LINHAO","U1320534K","SM2","SM2 (12 MTHS)","Single","ME"]
[null,null,null,"KUANG MINGYUAN","U1320535G","SM2","SM2 (20 MTHS)","Single","EEE"]
[null,null,null,"WANG HENGYANG","U1320536D","SM2","SM2 (12 MTHS)","Single","ME"]
[null,null,null,"ZHOU JINGYUAN","U1320538J","SM2","SM2 (12 MTHS)","Double (Type 1)","BCG"]
[null,null,null,"ZHANG MINGJIAN","U1320539F","SM2","SM2 (20 MTHS)","Single","ME"]
[null,null,null,"GAO CHENFENG","U1320540J","SM2","SM2 (20 MTHS)","Single","CEE"]
[null,null,null,"TANG CHENG","U1320542C","SM2","SM2 (12 MTHS)","Single","CSC"]
[null,null,null,"SUN QINGHE","U1320543L","SM2","SM2 (20 MTHS)","Single","MS"]
[null,null,null,"MA RUIYUAN","U1320549D","SM2","SM2 (12 MTHS)","Single","MS"]
[null,null,null,"LI WENLONG","U1320550G","SM2","SM2 (12 MTHS)","Single","MAT"]
[null,null,null,"LI HAIHUI","U1320551D","SM2","SM2 (20 MTHS)","Single","CSC"]
[null,null,null,"XING HUA","U1320553J","SM2","SM2 (20 MTHS)","Single","EEE"]
[null,null,null,"WEI YUMOU","U1320554F","SM2","SM2 (12 MTHS)","Double (Type 1)","BCG"]
[null,null,null,"SONG NAN","U1320555C","SM2","SM2 (20 MTHS)","Single","EEE"]
[null,null,null,"CHEN JIAYING","U1320556L","SM2","SM2 (12 MTHS)","Single","EEE"]
[null,null,null,"ZHAO JINGYING","U1320557H","SM2","SM2 (20 MTHS)","Double (Type 1)","BCG"]
[null,null,null,"JIANG YUE","U1320558E","SM2","SM2 (12 MTHS)","Single","AERO"]
[null,null,null,"SONG CHENXING","U1320559B","SM2","SM2 (12 MTHS)","Single","CSC"]
[null,null,null,"WANG YIMING","U1320560E","SM2","SM2 (20 MTHS)","Single","EEE"]
[null,null,null,"YUE ZHONGQI","U1320561B","SM2","SM2 (20 MTHS)","Single","EEE"]
[null,null,null,"XU WENQING","U1320562K","SM2","SM2 (12 MTHS)","Single","EEE"]
[null,null,null,"ZHU LINGZHI","U1320563G","SM2","SM2 (12 MTHS)","Single","EEE"]
[null,null,null,"HOU KAIYAN","U1320565A","SM2","SM2 (20 MTHS)","Single","CBE"]
[null,null,null,"LU PAI","U1320566J","SM2","SM2 (12 MTHS)","Single","EEE"]
[null,null,null,"SHA CHENJIA","U1320567F","SM2","SM2 (12 MTHS)","Single","MS"]
[null,null,null,"ZHONG ZHAOQI","U1320568C","SM2","SM2 (12 MTHS)","Single","IEM"]
[null,null,null,"QIAN MINGYANG","U1320569L","SM2","SM2 (12 MTHS)","Single","EEE"]
[null,null,null,"YAO QIANG","U1320570C","SM2","SM2 (12 MTHS)","Single","EEE"]
[null,null,null,"YANG QIDI","U1320571L","SM2","SM2 (12 MTHS)","Single","MAT"]
[null,null,null,"YAO YUAN","U1320572H","SM2","SM2 (12 MTHS)","Single","CEE"]
[null,null,null,"ZHANG WANXIN","U1320573E","SM2","SM2 (12 MTHS)",{"$f":"VLOOKUP(I$1:I$5281,$A$37:$B$212,2,FALSE)","v":"Single"},"MS"]
[null,null,null,"LI JINGYI","U1320574B","SM2","SM2 (20 MTHS)","Single","MAT"]
[null,null,null,"LU YUHAO","U1320576G","SM2","SM2 (20 MTHS)","Single","CSC"]
[null,null,null,"LUO ZHENNING","U1320577D","SM2","SM2 (12 MTHS)","Single","ME"]
[null,null,null,"YAN JINGPING","U1320578A","SM2","SM2 (12 MTHS)","Single","EEE"]
[null,null,null,"LIU JIAWEI","U1320580A","SM2","SM2 (20 MTHS)","Single","CBE"]
[null,null,null,"TAN QINGYU","U1320581J","SM2","SM2 (12 MTHS)","Single","AERO"]
[null,null,null,"LIU HUAIYUAN","U1320582F","SM2","SM2 (20 MTHS)","Single","CEE"]
[null,null,null,"TAN SHUWEN","U1320583C","SM2","SM2 (12 MTHS)","Single","ME"]
[null,null,null,"ZHAO JUNCHENG","U1320584L","SM2","SM2 (12 MTHS)","Single","IEM"]
[null,null,null,"ZHOU YANG","U1320585H","SM2","SM2 (12 MTHS)","Single","EEE"]
[null,null,null,"YU ZONGHONG","U1320586E","SM2","SM2 (12 MTHS)","Single","ME"]
[null,null,null,"WU JINBIN","U1320587B","SM2","SM2 (12 MTHS)","Single","ME"]
[null,null,null,"PENG YAXIN","U1320588K","SM2","SM2 (12 MTHS)","Single","EEE"]
[null,null,null,"ZHANG HANYUE","U1320589G","SM2","SM2 (20 MTHS)","Single","IEM"]
[null,null,null,"YAN YUE","U1320590K","SM2","SM2 (20 MTHS)","Single","EEE"]
[null,null,null,"WANG XINDA","U1320591G","SM2","SM2 (20 MTHS)","Single","EEE"]
[null,null,null,"ZHANG YUHAO","U1320592D","SM2","SM2 (12 MTHS)","Single","IEM"]
[null,null,null,"XIANG CHEN","U1320593A","SM2","SM2 (12 MTHS)","Single","EEE"]
[null,null,null,"ZHANG SHUJIE","U1320595F","SM2","SM2 (20 MTHS)","Single","EEE"]
[null,null,null,"HE CHAOYI","U1320596C","SM2","SM2 (12 MTHS)","Single","AERO"]
[null,null,null,"WANG HAO","U1320597L","SM2","SM2 (20 MTHS)","Single","EEE"]
[null,null,null,"YANG XUEHAO","U1320598H","SM2","SM2 (20 MTHS)","Single","EEE"]
[null,null,null,"DU YIBO","U1320599E","SM2","SM2 (12 MTHS)","Single","CBE"]
[null,null,null,"YAN QUCHENG","U1320600H","SM2","SM2 (20 MTHS)","Single","ME"]
[null,null,null,"XIA YU","U1320601E","SM2","SM2 (12 MTHS)","Single","EEE"]
[null,null,null,"WU JITONG","U1320602B","SM2","SM2 (20 MTHS)","Single","EEE"]
[null,null,null,"CHENG YUJIE","U1320604G","SM2","SM2 (20 MTHS)","Single","EEE"]
[null,null,null,"LI JUNRU","U1320605D","SM2","SM2 (20 MTHS)","Single","AERO"]
[null,null,null,"XU QIANQIAN","U1320607J","SM2","SM2 (20 MTHS)","Double (Type 1)","BCG"]
[null,null,null,"ZHANG XINXIN","U1320608F","SM2","SM2 (20 MTHS)","Single","BIE"]
[null,null,null,"WANG YUE","U1320609C","SM2","SM2 (12 MTHS)","Single","EEE"]
[null,null,null,"LIU YUHUI","U1320610F","SM2","SM2 (20 MTHS)","Single","EEE"]
[null,null,null,"XIAO YIKAI","U1320612L","SM2","SM2 (20 MTHS)","Single","IEM"]
[null,null,null,"HONG WEIWEI","U1320613H","SM2","SM2 (12 MTHS)","Single","IEM"]
[null,null,null,"ZHANG YUNDUO","U1320614E","SM2","SM2 (12 MTHS)","Single","EEE"]
[null,null,null,"YAO DENGHUI","U1320615B","SM2","SM2 (12 MTHS)","Single","ME"]
[null,null,null,"FU JIAXIANG","U1320616K","SM2","SM2 (12 MTHS)","Double (Type 1)","BCG"]
[null,null,null,"TANG LIYAO","U1320617G","SM2","SM2 (12 MTHS)","Single","CEE"]
[null,null,null,"ZHONG XIN","U1320618D","SM2","SM2 (12 MTHS)","Single","AERO"]
[null,null,null,"LUO TIANZE","U1320619A","SM2","SM2 (12 MTHS)","Single","EEE"]
[null,null,null,"ZHOU YANJUN","U1320620D","SM2","SM2 (20 MTHS)","Double (Type 1)","BCG"]
[null,null,null,"JI YUAN","U1320621A","SM2","SM2 (12 MTHS)","Single","EEE"]
[null,null,null,"YE SHUHONG","U1320622J","SM2","SM2 (12 MTHS)","Single","EEE"]
[null,null,null,"HUANG KUN","U1320623F","SM2","SM2 (12 MTHS)","Single","EEE"]
[null,null,null,"SHI ZHENYU","U1320624C","SM2","SM2 (12 MTHS)","Single","CBE"]
[null,null,null,"ZHENG QIMING","U1320626H","SM2","SM2 (12 MTHS)","Single","IEM"]
[null,null,null,"Lu Jiaxin","U1320627E","SM2","SM2 (12 MTHS)","Single","MS"]
[null,null,null,"ZHOU RAN","U1320628B","SM2","SM2 (12 MTHS)","Single","AERO"]
[null,null,null,"TANG JIATENG","U1320629K","SM2","SM2 (12 MTHS)","Single","EEE"]
[null,null,null,"SHAO YU","U1320630B","SM2","SM2 (12 MTHS)","Single","CBE"]
[null,null,null,"ZHOU YUNZHI","U1320631K","SM2","SM2 (20 MTHS)","Single","CBE"]
[null,null,null,"GAO CHUANCHAO","U1320633D","SM2","SM2 (12 MTHS)","Single","ME"]
[null,null,null,"ZHAO HUANGJIE","U1320634A","SM2","SM2 (12 MTHS)","Single","IEM"]
[null,null,null,"ZHANG TONGSHUO","U1320635J","SM2","SM2 (12 MTHS)","Double (Type 1)","BCE"]
[null,null,null,"XIE JIANGSHAN","U1320636F","SM2","SM2 (12 MTHS)","Single","MS"]
[null,null,null,"LI LEI","U1320637C","SM2","SM2 (12 MTHS)","Single","MS"]
[null,null,null,"LI YUANRUI","U1320638L","SM2","SM2 (12 MTHS)","Single","CSC"]
[null,null,null,"CAO GAOXU","U1320639H","SM2","SM2 (20 MTHS)","Double (Type 1)","BCG"]
[null,null,null,"ZHANG YIXUAN","U1320640L","SM2","SM2 (12 MTHS)","Single","CBE"]
[null,null,null,"ZHANG JUNYI","U1320641H","SM2","SM2 (12 MTHS)","Single","CBE"]
[null,null,null,"LI QI","U1320642E","SM2","SM2 (20 MTHS)","Single","ME"]
[null,null,null,"LIN QIAN","U1320643B","SM2","SM2 (20 MTHS)","Single","CE"]
[null,null,null,"MIAO LINGYU","U1320644K","SM2","SM2 (12 MTHS)","Single","CEE"]
[null,null,null,"LIU YUHAN","U1320645G","SM2","SM2 (12 MTHS)",{"$f":"VLOOKUP(I$1:I$5281,$A$37:$B$212,2,FALSE)","v":"Single"},"MS"]
[null,null,null,"TANG BIJUN","U1320646D","SM2","SM2 (20 MTHS)","Single","MAT"]
[null,null,null,"XIA MINGHONG","U1320647A","SM2","SM2 (12 MTHS)","Double (Type 1)","BCG"]
[null,null,null,"BAI ZIYI","U1320648J","SM2","SM2 (12 MTHS)","Single","AERO"]
[null,null,null,"YANG JINGFAN","U1320649F","SM2","SM2 (12 MTHS)","Single","CBE"]
[null,null,null,"YANG TAOZHENG","U1320650J","SM2","SM2 (12 MTHS)","Single","ME"]
[null,null,null,"ZHANG BEITE","U1320652C","SM2","SM2 (20 MTHS)","Single","EEE"]
[null,null,null,"ZHU WANYI","U1320654H","SM2","SM2 (12 MTHS)","Single","CBE"]
[null,null,null,"CAO TONGTONG","U1320655E","SM2","SM2 (12 MTHS)","Single","EEE"]
[null,null,null,"CHEN YULIN","U1320656B","SM2","SM2 (20 MTHS)","Single","EEE"]
[null,null,null,"SUN XUE","U1320657K","SM2","SM2 (12 MTHS)","Single","BIE"]
[null,null,null,"MU HUANWEN","U1320659D","SM2","SM2 (20 MTHS)","Single","CBE"]
[null,null,null,"GUAN QIN","U1320660G","SM2","SM2 (12 MTHS)","Single","CEE"]
[null,null,null,"WEN XIN","U1320661D","SM2","SM2 (20 MTHS)","Single","IEM"]
[null,null,null,"ZHANG YIMEI","U1320662A","SM2","SM2 (20 MTHS)","Single","BIE"]
[null,null,null,"ZHANG MINCHUAN","U1320663J","SM2","SM2 (20 MTHS)","Single","MAT"]
[null,null,null,"ZHAO GUANGYE","U1320664F","SM2","SM2 (20 MTHS)","Single","EEE"]
[null,null,null,"LI YUN","U1320665C","SM2","SM2 (12 MTHS)","Single","MAT"]
[null,null,null,"DONG YIBING","U1320666L","SM2","SM2 (12 MTHS)","Single","MAT"]
[null,null,null,"CHEN SIXUAN","U1320667H","SM2","SM2 (12 MTHS)","Single","EEE"]
[null,null,null,"LIU LU","U1320668E","SM2","SM2 (12 MTHS)","Single","EEE"]
[null,null,null,"ZANG JINLIANG","U1320669B","SM2","SM2 (12 MTHS)","Single","ME"]
[null,null,null,"ZHANG MEIXIA","U1320670E","SM2","SM2 (20 MTHS)","Single","CSC"]
[null,null,null,"YANG MINGYU","U1320671B","SM2","SM2 (12 MTHS)","Single","CE"]
[null,null,null,"LUO SHIJUN","U1320672K","SM2","SM2 (20 MTHS)","Single","MS"]
[null,null,null,"CHENG PENGHUI","U1320673G","SM2","SM2 (12 MTHS)","Single","CBE"]
[null,null,null,"WANG YU","U1320674D","SM2","SM2 (12 MTHS)","Single","EEE"]
[null,null,null,"LUO WANYI","U1320675A","SM2","SM2 (12 MTHS)","Single","ME"]
[null,null,null,"WANG CE","U1320676J","SM2","SM2 (12 MTHS)","Single","EEE"]
[null,null,null,"LIU HAOTIAN","U1320677F","SM2","SM2 (20 MTHS)","Single","AERO"]
[null,null,null,"LIU TONG","U1320678C","SM2","SM2 (12 MTHS)","Single","ME"]
[null,null,null,"ZHOU DONGXIN","U1320679L","SM2","SM2 (12 MTHS)","Single","EEE"]
[null,null,null,"HAN XIAOXING","U1320680C","SM2","SM2 (20 MTHS)","Single","CBE"]
[null,null,null,"ZENG YIXI","U1320681L","SM2","SM2 (20 MTHS)","Single","AERO"]
[null,null,null,"CUI JUNPENG","U1320683E","SM2","SM2 (20 MTHS)","Single","CEE"]
[null,null,null,"MEI DONGNI","U1320684B","SM2","SM2 (12 MTHS)","Single","EEE"]
[null,null,null,"XU YUECONG","U1320685K","SM2","SM2 (12 MTHS)","Single","EEE"]
[null,null,null,"LIU SHUQING","U1320686G","SM2","SM2 (12 MTHS)","Single","MATH"]
[null,null,null,"LI HONGTING","U1320687D","SM2","SM2 (12 MTHS)","Single","CEE"]
[null,null,null,"YU TONG","U1320688A","SM2","SM2 (20 MTHS)","Single","ME"]
[null,null,null,"LIANG ZIMOU","U1320689J","SM2","SM2 (12 MTHS)","Single","BIE"]
[null,null,null,"JIA BAOQI","U1320690A","SM2","SM2 (12 MTHS)","Single","EEE"]
[null,null,null,"WU YIN","U1320715D","SM2","SM2 (12 MTHS)","Single","EEE"]
[null,null,null,"ZHAN MENGKE","U1320752E","MOE PreU Scholar (PRC)","NA","Single","AERO"]
[null,null,null,"CHEN MIN","U1320801J","MOE PreU Scholar (PRC)","SM2 (20 MTHS)","Single","AERO"]
[null,null,null,"NATHASYA MICHELL","U1320854A",null,"SM2 (12 MTHS)","Single","CEE"]
[null,null,null,"KUMAR SWAPNIL","U1320876B","SIA Youth","SM2 (12 MTHS)","Single","ME"]
[null,null,null,"CAO MUQING","U1320940F","MOE PreU Scholar (PRC)","SM2 (20 MTHS)","Single","AERO"]
[null,null,null,"LU YUNFAN","U1320963D","MOE PreU Scholar (PRC)","SM2 (12 MTHS)","Single","EEE"]
[null,null,null,"LI JINGNING","U1321008H","MOE PreU Scholar (PRC)","SM2 (20 MTHS)","Single","AERO"]
[null,null,null,"RAMAMURTHY SWETHA","U1321260B",null,"SM2 (12 MTHS)","Single","EEE"]
[null,null,null,"SUNIL NAVNITA","U1321332D",null,"SM2 (20 MTHS)","Single","EEE"]
[null,null,null,"LI JIAYU","U1321372G","MOE PreU Scholar (PRC)","SM2 (12 MTHS)","Double (Type 2)","ENEC"]
[null,null,null,"YU SONG","U1321550K","MOE PreU Scholar (PRC)","SM2 (12 MTHS)","Single","MS"]
[null,null,null,"LIU PENG","U1321698B","MOE PreU Scholar (PRC)","SM2 (12 MTHS)","Double (Type 1)","BCG"]
[null,null,null,"ZHAO YUE","U1321704A","MOE PreU Scholar (PRC)","SM2 (12 MTHS)","Single","AERO"]
[null,null,null,"LIN ZEXIN","U1322131F","MOE PreU Scholar (PRC)","SM2 (20 MTHS)","Single","AERO"]
[null,null,null,"HU HAIWEI","U1322325L","MOE PreU Scholar (PRC)","SM2 (12 MTHS)","Single","AERO"]
[null,null,null,"MOHANAN NEETHU","U1322625F",null,"SM2 (12 MTHS)","Single","CE"]
[null,null,null,"KANNAN GOWRI","U1322901F",null,"SM2 (12 MTHS)","Single","EEE"]
[null,null,null,"BANSAL ANKUR","U1322989K",null,"SM2 (20 MTHS)","Single","CSC"]
[null,null,null,"GUPTA TANISHQ","U1322992G",null,"SM2 (20 MTHS)","Single","ME"]
[null,null,null,"PILLARISETTY VENKATA PRANAV","U1322993D",null,"SM2 (20 MTHS)","Single","ME"]
[null,null,null,"CHHABRA AISHWARYA","U1322996F",null,"SM2 (12 MTHS)","Single","CE"]
[null,null,null,"JESSICA NGINDA","U1340023B",null,"SM2 (12 MTHS)",{"$f":"VLOOKUP(I$1:I$5281,$A$37:$B$212,2,FALSE)","v":"Single"},"CHEM"]
[null,null,null,"KRISMA SHANDY KOMARUZZAMAN","U1340024K",null,"SM2 (20 MTHS)","Single","MAEC"]
[null,null,null,"NIXIE SAPPHIRA LESMANA","U1340030J",null,"SM2 (12 MTHS)","Single","MATH"]
[null,null,null,"FRANCES WIDJAJA","U1340031F",null,"SM2 (12 MTHS)","Single","CHEM"]
[null,null,null,"ADRIANUS CHRISTOPHER","U1340032C",null,"SM2 (12 MTHS)","Single","CHEM"]
[null,null,null,"JANSEN WANGSAWIDJAJA","U1340035E",null,"SM2 (20 MTHS)","Single","MATH"]
[null,null,null,"BELLA ROSA LIYARITA","U1340044F","SM2","SM2 (12 MTHS)","Single","CHEM"]
[null,null,null,"MATTHEW ZAKHARIA HADIMAJA","U1340053G",null,"SM2 (12 MTHS)","Single","MATH"]
[null,null,null,"NATASHA ODELIA TANJUNG","U1340054D",null,"SM2 (20 MTHS)","Single","MATH"]
[null,null,null,"FELICIA MARTINA","U1340064B",null,"SM2 (20 MTHS)","Single","CHEM"]
[null,null,null,"SHANNON NG","U1340068A",null,"SM2 (20 MTHS)","Single","MATH"]
[null,null,null,"GUO TONGFEI","U1340098F","SM2","SM2 (12 MTHS)","Single","PHY"]
[null,null,null,"QIN JIN","U1340099C","SM2","SM2 (12 MTHS)","Single","MAEC"]
[null,null,null,"CHEN QIANCAI","U1340100F","SM2","SM2 (12 MTHS)","Single","MAEC"]
[null,null,null,"LONG HAIYAN","U1340101C","SM2","SM2 (12 MTHS)","Single","MAEC"]
[null,null,null,"LIN NANZHENG","U1340102L","SM2","SM2 (12 MTHS)","Single","MAEC"]
[null,null,null,"YU MUXUAN","U1340103H","SM2","SM2 (12 MTHS)","Single","MAEC"]
[null,null,null,"XIANG QINLIN","U1340104E","SM2","SM2 (12 MTHS)","Single","MAEC"]
[null,null,null,"YANG MING","U1340106K","SM2","SM2 (20 MTHS)","Single","BS"]
[null,null,null,"REN JIAYI","U1340107G","SM2","SM2 (20 MTHS)","Single","MAEC"]
[null,null,null,"LIU YUCHENG","U1340108D","SM2","SM2 (20 MTHS)","Single","MATH"]
[null,null,null,"QIAN CHENG","U1340109A","SM2","SM2 (12 MTHS)","Single","MATH"]
[null,null,null,"CHEN ZHANG","U1340110D","SM2","SM2 (12 MTHS)","Single","MAEC"]
[null,null,null,"CHEN YIZHOU","U1340111A","SM2","SM2 (12 MTHS)","Single","PHY"]
[null,null,null,"WANG QUANMENG","U1340112J","SM2","SM2 (20 MTHS)","Single","MATH"]
[null,null,null,"TANG ANQI","U1340113F","SM2","SM2 (12 MTHS)","Single","MATH"]
[null,null,null,"ZHU PEI","U1340114C","SM2","SM2 (12 MTHS)","Single","PHY"]
[null,null,null,"LIU ZHEHUI","U1340115L","SM2","SM2 (12 MTHS)","Single","BS"]
[null,null,null,"PENG QIANHUI","U1340116H","SM2","SM2 (20 MTHS)","Single","MATH"]
[null,null,null,"CHEN WEIRONG","U1340117E","SM2","SM2 (20 MTHS)","Single","MATH"]
[null,null,null,"GUO DONGSHAN","U1340118B","SM2","SM2 (20 MTHS)","Single","MAEC"]
[null,null,null,"SUN YANG","U1340119K","SM2","SM2 (12 MTHS)","Single","MAEC"]
[null,null,null,"CAI YUYANG","U1340121K","SM2","SM2 (12 MTHS)","Single","MATH"]
[null,null,null,"WANG ZHAOYU","U1340122G","SM2","SM2 (20 MTHS)","Single","MAEC"]
[null,null,null,"CHAO QIN","U1340123D","SM2","SM2 (12 MTHS)","Single","MATH"]
[null,null,null,"WANG ZIJUN","U1340124A","SM2","SM2 (12 MTHS)","Single","MAEC"]
[null,null,null,"LIU HUANZHI","U1340125J","SM2","SM2 (12 MTHS)","Single","MATH"]
[null,null,null,"CHEN YONGXIAO","U1340127C","SM2","SM2 (20 MTHS)","Single","MAEC"]
[null,null,null,"WANG JIALIN","U1340128L","SM2","SM2 (12 MTHS)","Single","MATH"]
[null,null,null,"GAN JIAWEN","U1340129H","SM2","SM2 (12 MTHS)","Single","MAEC"]
[null,null,null,"ZHUO XIANGYU","U1340131H","SM2","SM2 (20 MTHS)","Single","MAEC"]
[null,null,null,"YUAN YE","U1340132E","SM2","SM2 (20 MTHS)","Single","MATH"]
[null,null,null,"LI XINXIN","U1340133B","SM2","SM2 (20 MTHS)","Single","MAEC"]
[null,null,null,"ZHANG NAIFAN","U1340134K","SM2","SM2 (12 MTHS)","Single","MATH"]
[null,null,null,"CHEN SHUAI","U1340135G","SM2","SM2 (12 MTHS)","Single","MAEC"]
[null,null,null,"BI JINGYING","U1340136D","SM2","SM2 (12 MTHS)","Single","MAEC"]
[null,null,null,"ZHOU WEI","U1340137A","SM2","SM2 (12 MTHS)","Single","BS"]
[null,null,null,"LIU SIDI","U1340138J","SM2","SM2 (12 MTHS)","Single","MATH"]
[null,null,null,"LIU YAXIN","U1340139F","SM2","SM2 (12 MTHS)","Single","MAEC"]
[null,null,null,"LI WENXIN","U1340140J","SM2","SM2 (12 MTHS)","Single","MAEC"]
[null,null,null,"LUO YUANYUAN","U1340141F","SM2","SM2 (20 MTHS)","Single","BS"]
[null,null,null,"LIU SIYING","U1340142C","SM2","SM2 (20 MTHS)","Single","MATH"]
[null,null,null,"GUAN ZHEN","U1340539C","MOE PreU Scholar (PRC)","SM2 (20 MTHS)","Single","MATH"]
[null,null,null,"WANG HAN","U1420625G","SM2","SM2 (12 MTHS)","Single","MAT"]
[null,null,null,"AO TIANCI","U1420626D","SM2","SM2 (12 MTHS)","Single","AERO"]
[null,null,null,"MA YUNQIAO","U1420627A","SM2","SM2 (12 MTHS)","Single","CBE"]
[null,null,null,"LIN TIAN","U1420629F","SM2","SM2 (12 MTHS)","Single","IEM"]
[null,null,null,"CAO MINGXUAN","U1420630J","SM2","SM2 (12 MTHS)","Single","CEE"]
[null,null,null,"YANG FAN","U1420631F","SM2","SM2 (12 MTHS)","Single","CEE"]
[null,null,null,"REN JUNJIE","U1420632C","SM2","SM2 (12 MTHS)","Single","CBE"]
[null,null,null,"LIU YIZHOU","U1420633L","SM2","SM2 (12 MTHS)","Single","EEE"]
[null,null,null,"LU LINXUAN","U1420634H","SM2","SM2 (12 MTHS)","Single","CSC"]
[null,null,null,"XIAO BOWEN","U1420635E","SM2","SM2 (12 MTHS)","Single","MS"]
[null,null,null,"TONG WENBIN","U1420636B","SM2","SM2 (12 MTHS)","Single","EEE"]
[null,null,null,"ZHANG YIHANG","U1420637K","SM2","SM2 (12 MTHS)",{"$f":"VLOOKUP(I$1:I$5281,$A$37:$B$212,2,FALSE)","v":"Single"},"EEE"]
[null,null,null,"ZHANG WANLU","U1420638G","SM2","SM2 (12 MTHS)","Single","CSC"]
[null,null,null,"ZHANG YIFAN","U1420639D","SM2","SM2 (12 MTHS)","Single","MS"]
[null,null,null,"CHEN SHIJIAN","U1420640G","SM2","SM2 (12 MTHS)","Single","AERO"]
[null,null,null,"WANG SIQI","U1420641D","SM2","SM2 (12 MTHS)","Single","EEE"]
[null,null,null,"WU PEILI","U1420642A","SM2","SM2 (12 MTHS)","Single","EEE"]
[null,null,null,"ZHAO YIDENG","U1420643J","SM2","SM2 (12 MTHS)","Single","EEE"]
[null,null,null,"LIU DIKAI","U1420644F","SM2","SM2 (12 MTHS)","Single","ME"]
[null,null,null,"GU YAJIE","U1420645C","SM2","SM2 (12 MTHS)","Single","MS"]
[null,null,null,"HOU JIANWEN","U1420646L","SM2","SM2 (12 MTHS)","Single","EEE"]
[null,null,null,"MAO KAIYI","U1420647H","SM2","SM2 (12 MTHS)","Single","EEE"]
[null,null,null,"WANG WENHAO","U1420648E","SM2","SM2 (12 MTHS)","Single","CEE"]
[null,null,null,"SONG JINNING","U1420649B","SM2","SM2 (12 MTHS)","Single","CEE"]
[null,null,null,"WANG JINING","U1420650E","SM2","SM2 (12 MTHS)","Single","MAT"]
[null,null,null,"CHEN SIXUAN","U1420653G","SM2","SM2 (12 MTHS)","Single","MS"]
[null,null,null,"LIU ZHENG","U1420654D","SM2","SM2 (12 MTHS)","Single","EEE"]
[null,null,null,"WANG XIAOTING","U1420655A","SM2","SM2 (12 MTHS)","Single","CSC"]
[null,null,null,"LIU YUXUAN","U1420656J","SM2","SM2 (12 MTHS)","Single","CEE"]
[null,null,null,"REN DAXUAN","U1420657F","SM2","SM2 (12 MTHS)","Single","CSC"]
[null,null,null,"LIU SIYUAN","U1420658C","SM2","SM2 (12 MTHS)","Single","CSC"]
[null,null,null,"CHANG WENXIAN","U1420659L","SM2","SM2 (12 MTHS)","Single","MS"]
[null,null,null,"JIN XIAOJIA","U1420660C","SM2","SM2 (12 MTHS)","Single","CBE"]
[null,null,null,"YUAN PEIYUE","U1420661L","SM2","SM2 (12 MTHS)","Single","ME"]
[null,null,null,"CUI JIASHAN","U1420662H","SM2","SM2 (12 MTHS)","Single","CEE"]
[null,null,null,"CHENG KUNPENG (Bond Terminated)","U1420663E","SM2","SM2 (12 MTHS)","Single","EEE"]
[null,null,null,"ZHOU JIADONG","U1420664B","SM2","SM2 (12 MTHS)","Single","ME"]
[null,null,null,"LIU TIANRUI","U1420665K","SM2","SM2 (12 MTHS)","Single","AERO"]
[null,null,null,"MIAO YANXIN","U1420667D","SM2","SM2 (12 MTHS)","Single","EEE"]
[null,null,null,"YAN HAOYANG","U1420668A","SM2","SM2 (12 MTHS)","Single","MAT"]
[null,null,null,"CHENG YU","U1420669J","SM2","SM2 (12 MTHS)","Single","EEE"]
[null,null,null,"REN HAOSU","U1420670A","SM2","SM2 (12 MTHS)","Single","IEM"]
[null,null,null,"LU YAMAN","U1420671J","SM2","SM2 (12 MTHS)","Double (Type 1)","BCG"]
[null,null,null,"WU SIQI","U1420672F","SM2","SM2 (12 MTHS)","Single","IEM"]
[null,null,null,"ZHOU YI","U1420673C","SM2","SM2 (12 MTHS)","Single","EEE"]
[null,null,null,"XU ZIYI","U1420674L","SM2","SM2 (12 MTHS)","Single","MS"]
[null,null,null,"LIU XIAOYU","U1420675H","SM2","SM2 (12 MTHS)","Single","IEM"]
[null,null,null,"SONG TIANYI","U1420676E","SM2","SM2 (12 MTHS)","Single","IEM"]
[null,null,null,"HOU DANNI","U1420677B","SM2","SM2 (12 MTHS)","Single","CEE"]
[null,null,null,"HUANG SHUAI","U1420678K","SM2","SM2 (12 MTHS)","Single","CSC"]
[null,null,null,"CAI ZHUOHAN","U1420679G","SM2","SM2 (12 MTHS)","Single","AERO"]
[null,null,null,"CHEN ZIAO","U1420681G","SM2","SM2 (12 MTHS)","Double (Type 1)","BCG"]
[null,null,null,"YANG WENSI","U1420682D","SM2","SM2 (12 MTHS)","Single","MAT"]
[null,null,null,"ZHANG JINYAN","U1420683A","SM2","SM2 (12 MTHS)","Single","AERO"]
[null,null,null,"GAO RANYU","U1420684J","SM2","SM2 (12 MTHS)","Single","ME"]
[null,null,null,"ZHAO HAN","U1420685F","SM2","SM2 (12 MTHS)","Single","EEE"]
[null,null,null,"LI WENCHENG","U1420686C","SM2","SM2 (12 MTHS)","Single","EEE"]
[null,null,null,"LU CHENGHAO","U1420688H","SM2","SM2 (12 MTHS)","Double (Type 1)","BCG"]
[null,null,null,"ZHONG YIXUAN","U1420689E","SM2","SM2 (12 MTHS)","Single","CEE"]
[null,null,null,"WANG SHU","U1420690H","SM2","SM2 (12 MTHS)","Single","CSC"]
[null,null,null,"YI CHENYU","U1420692B","SM2","SM2 (12 MTHS)","Single","EEE"]
[null,null,null,"SUN ZHIHAO","U1420694G","SM2","SM2 (12 MTHS)","Single","CSC"]
[null,null,null,"PAN ZIYUAN","U1420695D","SM2","SM2 (12 MTHS)","Single","EEE"]
[null,null,null,"LIU GUANGYAO","U1420696A","SM2","SM2 (12 MTHS)","Single","IEM"]
[null,null,null,"ZHANG ZHENGYANG","U1420697J","SM2","SM2 (12 MTHS)","Single","ME"]
[null,null,null,"CHEN HAIPEI","U1420698F","SM2","SM2 (12 MTHS)","Single","MS"]
[null,null,null,"LEI MING","U1420699C","SM2","SM2 (12 MTHS)","Double (Type 1)","BCG"]
[null,null,null,"LI XINTONG","U1420700F","SM2","SM2 (12 MTHS)","Single","IEM"]
[null,null,null,"ZHU YIMIN","U1420701C","SM2","SM2 (12 MTHS)","Single","CSC"]
[null,null,null,"XU YIMIN","U1420702L","SM2","SM2 (12 MTHS)","Single","CSC"]
[null,null,null,"YANG CHUNXIAO","U1420703H","SM2","SM2 (12 MTHS)","Single","ME"]
[null,null,null,"ZHANG LINGHAN","U1420704E","SM2","SM2 (12 MTHS)","Single","IEM"]
[null,null,null,"ZHANG ZIYI","U1420705B","SM2","SM2 (12 MTHS)","Single","EEE"]
[null,null,null,"ZHANG GUOBIN","U1420706K","SM2","SM2 (12 MTHS)","Single","EEE"]
[null,null,null,"DENG ZICHAO","U1420707G","SM2","SM2 (12 MTHS)","Single","IEM"]
[null,null,null,"LI MENGMEI","U1420708D","SM2","SM2 (12 MTHS)",{"$f":"VLOOKUP(I$1:I$5281,$A$37:$B$212,2,FALSE)","v":"Single"},"CEE"]
[null,null,null,"YIN WANQI","U1420709A","SM2","SM2 (12 MTHS)","Single","ME"]
[null,null,null,"TIAN SIYU","U1420710D","SM2","SM2 (12 MTHS)","Single","ME"]
[null,null,null,"WANG JIARUI","U1420711A","SM2","SM2 (12 MTHS)","Single","AERO"]
[null,null,null,"LI YUCHEN","U1420712J","SM2","SM2 (12 MTHS)","Single","EEE"]
[null,null,null,"LIU MENGRUI","U1420713F","SM2","SM2 (12 MTHS)","Single","EEE"]
[null,null,null,"LI RUIRUI","U1420715L","SM2","SM2 (12 MTHS)","Single","EEE"]
[null,null,null,"WAN YI","U1420717E","SM2","SM2 (12 MTHS)","Single","AERO"]
[null,null,null,"LIN HANYE","U1420718B","SM2","SM2 (12 MTHS)","Single","MS"]
[null,null,null,"LIU DINGFEI","U1420719K","SM2","SM2 (12 MTHS)","Single","MS"]
[null,null,null,"WEN TIANHAO","U1420720B","SM2","SM2 (12 MTHS)","Single","CEE"]
[null,null,null,"PAN JIANGDONG","U1420721K","SM2","SM2 (12 MTHS)","Double (Type 1)","BCG"]
[null,null,null,"SHAO YIYANG","U1420722G","SM2","SM2 (12 MTHS)","Single","CSC"]
[null,null,null,"WANG HAOTIAN","U1420723D","SM2","SM2 (12 MTHS)","Single","IEM"]
[null,null,null,"WANG ZHIQUAN","U1420724A","SM2","SM2 (12 MTHS)","Single","EEE"]
[null,null,null,"QIU BAOSHU","U1420725J","SM2","SM2 (12 MTHS)","Single","EEE"]
[null,null,null,"DU CUIQIANHE","U1420726F","SM2","SM2 (12 MTHS)","Single","EEE"]
[null,null,null,"WEI ZHI","U1420728L","SM2","SM2 (12 MTHS)","Single","MAT"]
[null,null,null,"ZHOU ZHIYAO","U1420729H","SM2","SM2 (12 MTHS)","Double (Type 1)","BCG"]
[null,null,null,"MA XINYUE","U1420730L","SM2","SM2 (12 MTHS)","Single","IEM"]
[null,null,null,"HUANG LYUDAN","U1420731H","SM2","SM2 (12 MTHS)","Single","MS"]
[null,null,null,"CUI BOLUN","U1420732E","SM2","SM2 (12 MTHS)","Single","CSC"]
[null,null,null,"LIU HUALIN","U1420733B","SM2","SM2 (12 MTHS)","Single","CSC"]
[null,null,null,"FU QIANG","U1420735G","SM2","SM2 (12 MTHS)","Single","CSC"]
[null,null,null,"SHI FENG","U1420737A","SM2","SM2 (12 MTHS)","Single","CEE"]
[null,null,null,"LI FANXIANG","U1420799E","MOE PreU Scholar (PRC)","No bridging","Double (Type 2)","CBEC"]
[null,null,null,"WANG ZHE","U1420838L","MOE PreU Scholar (PRC)","No bridging","Single","CBE"]
[null,null,null,"MIAO YIXIN","U1420926K","MOE PreU Scholar (PRC)","No bridging","Single","AERO"]
[null,null,null,"LIU ZIQI","U1421086E","MOE PreU Scholar (PRC)","No bridging","Single","MS"]
[null,null,null,"HUANG WANYI","U1421163J","MOE PreU Scholar (PRC)","No bridging","Single","CSC"]
[null,null,null,"MA KOU","U1421213K","MOE PreU Scholar (PRC)","No bridging","Single","CBE"]
[null,null,null,"SRIVASTAVA SHREYA","U1421407D",null,"No bridging","Single","CE"]
[null,null,null,"JACOB SUNNY","U1421414L",null,"No bridging","Single","CE"]
[null,null,null,"TANG WEIYI","U1421441C","SM2","No bridging","Single","AERO"]
[null,null,null,"LIU TIANLI","U1421883H","MOE PreU Scholar (PRC)","No bridging","Single","IEM"]
[null,null,null,"CHOPRA VIRAT KRISHAN","U1422252H",null,"No bridging","Single","CSC"]
[null,null,null,"LI GANLIN","U1422443L","MOE PreU Scholar (PRC)","No bridging","Single","AERO"]
[null,null,null,"TIAN LUCHI","U1422916G","MOE PreU Scholar (PRC)","No bridging","Single","MAT"]
[null,null,null,"LODUGU NITHESH REDDY","U1422959A",null,"No bridging","Single","EEE"]
[null,null,null,"DUTTA ADITI","U1422973D",null,"No bridging","Single","CSC"]
[null,null,null,"JAGANNATH PRATYUM","U1422974A",null,"No bridging","Single","CE"]
[null,null,null,"ZAMAN MOHAMMAD SHARIQUE","U1422997K",null,"No bridging","Single","CSC"]
[null,null,null,"LIN YEYANG","U1422999D","MOE PreU Scholar (PRC)","No bridging","Single","AERO"]
[null,null,null,"GARG UTSAV","U1423014J",null,"No bridging","Single","CSC"]
[null,null,null,"KHARE SIMRAN","U1423025D",null,"No bridging","Single","CSC"]
[null,null,null,"DALMIA SACHIN","U1423049K",null,"No bridging","Single","CE"]
[null,null,null,"LIU YAXIN","U1440160A","SM2","SM2 (12 MTHS)","Single","BS"]
[null,null,null,"YANG WENJIE","U1440161J","SM2","SM2 (12 MTHS)","Single","MATH"]
[null,null,null,"XU BAIHUI","U1440162F","SM2","SM2 (12 MTHS)","Single","MATH"]
[null,null,null,"CHEN RUNZE","U1440163C","SM2","SM2 (12 MTHS)","Single","MATH"]
[null,null,null,"XIE GUANGYU","U1440164L","SM2","SM2 (12 MTHS)","Single","MATH"]
[null,null,null,"LIN SIKAI","U1440166E","SM2","SM2 (12 MTHS)","Single","MATH"]
[null,null,null,"LI YANGGENG","U1440167B","SM2","SM2 (12 MTHS)","Single","PHY"]
[null,null,null,"YIN YIMENG","U1440168K","SM2","SM2 (12 MTHS)","Single","MATH"]
[null,null,null,"SHA ZHENGHAN","U1440169G","SM2","SM2 (12 MTHS)","Single","MAEC"]
[null,null,null,"LIU ZHUOHAN","U1440170K","SM2","SM2 (12 MTHS)","Single","MAEC"]
[null,null,null,"LI HUAISHEN","U1440171G","SM2","SM2 (12 MTHS)","Single","MATH"]
[null,null,null,"FU CHENDI","U1440172D","SM2","SM2 (12 MTHS)","Single","MATH"]
[null,null,null,"XIAN HAO","U1440173A","SM2","SM2 (12 MTHS)","Single","MAEC"]
[null,null,null,"MA SONGYANG","U1440174J","SM2","SM2 (12 MTHS)","Single","MATH"]
[null,null,null,"WEI YUYANG","U1440175F","SM2","SM2 (12 MTHS)","Single","MATH"]
[null,null,null,"WANG XUEQING","U1440176C","SM2","SM2 (12 MTHS)","Single","MATH"]
[null,null,null,"GUO TAI","U1440177L","SM2","SM2 (12 MTHS)","Single","CHEM"]
[null,null,null,"XIA TINGFEI","U1440178H","SM2","SM2 (12 MTHS)","Single","MATH"]
[null,null,null,"CUI LIN","U1440179E","SM2","SM2 (12 MTHS)",{"$f":"VLOOKUP(I$1:I$5281,$A$37:$B$212,2,FALSE)","v":"Single"},"MAEC"]
[null,null,null,"WU SONGRONG","U1440180H","SM2","SM2 (12 MTHS)","Single","MAEC"]
[null,null,null,"LONG YUXUAN","U1440181E","SM2","SM2 (12 MTHS)","Single","MAEC"]
[null,null,null,"LIU NAYUAN","U1440182B","SM2","SM2 (12 MTHS)","Single","MAEC"]
[null,null,null,"SUN XINYU","U1440183K","SM2","SM2 (12 MTHS)","Single","MATH"]
[null,null,null,"LI NANGE","U1440184G","SM2","SM2 (12 MTHS)","Single","MAEC"]
[null,null,null,"ZHOU ZHOU","U1440185D","SM2","SM2 (12 MTHS)","Single","MAEC"]
[null,null,null,"XIONG YING","U1440233L","MOE PreU Scholar (PRC)","No bridging","Single","PHY"]
[null,null,null,"WANG LEI","U1440453L","SM2","SM2 (12 MTHS)","Single","MAEC"]
[null,null,null,"ZHAO XINGHE","U1520544L","SM2","SM2 (12 MTHS)","Single","EEE"]
[null,null,null,"ZHAO JINGYI","U1520545H","SM2","SM2 (12 MTHS)","Single","CSC"]
[null,null,null,"LIU ZHIWEI","U1520546E","SM2","SM2 (12 MTHS)","Single","CE"]
[null,null,null,"SUI CHENGKUN","U1520547B","SM2","SM2 (12 MTHS)","Single","ME"]
[null,null,null,"ZHENG WANQI","U1520548K","SM2","SM2 (12 MTHS)","Single","CSC"]
[null,null,null,"HAO ANRAN","U1520549G","SM2","SM2 (12 MTHS)","Single","IEM"]
[null,null,null,"WANG YIQI","U1520550K","SM2","SM2 (12 MTHS)","Single","CSC"]
[null,null,null,"XU SHAOQING","U1520551G","SM2","SM2 (12 MTHS)","Single","EEE"]
[null,null,null,"HU GUOYU","U1520552D","SM2","SM2 (12 MTHS)","Single","MAT"]
[null,null,null,"ZHU TINGER","U1520553A","SM2","SM2 (12 MTHS)","Single","CEE"]
[null,null,null,"GONG ZHEN","U1520554J","SM2","SM2 (12 MTHS)","Single","CSC"]
[null,null,null,"DING NI","U1520555F","SM2","SM2 (12 MTHS)","Single","EEE"]
[null,null,null,"TAN WEIWEI","U1520556C","SM2","SM2 (12 MTHS)","Single","EEE"]
[null,null,null,"HE SIYING","U1520559E","SM2","SM2 (12 MTHS)","Single","MS"]
[null,null,null,"ZHANG YUANCE","U1520561E","SM2","SM2 (12 MTHS)","Single","CSC"]
[null,null,null,"YANG ZHUTIAN","U1520562B","SM2","SM2 (12 MTHS)","Single","IEM"]
[null,null,null,"ZUO YUENING","U1520563K","SM2","SM2 (12 MTHS)","Single","CEE"]
[null,null,null,"ZHANG YULU","U1520564G","SM2","SM2 (12 MTHS)","Single","CEE"]
[null,null,null,"DONG YUTING","U1520565D","SM2","SM2 (12 MTHS)","Single","MAT"]
[null,null,null,"ZHANG RUILIN","U1520566A","SM2","SM2 (12 MTHS)","Single","CEE"]
[null,null,null,"SONG JIAZE","U1520567J","SM2","SM2 (12 MTHS)","Single","EEE"]
[null,null,null,"SHEN YUAN","U1520568F","SM2","SM2 (12 MTHS)","Single","EEE"]
[null,null,null,"MENG RUOSHAN","U1520569C","SM2","SM2 (12 MTHS)","Single","EEE"]
[null,null,null,"WU LIUHAO","U1520570F","SM2","SM2 (12 MTHS)","Single","EEE"]
[null,null,null,"FAN XIAOFENG","U1520572L","SM2","SM2 (12 MTHS)","Single","EEE"]
[null,null,null,"ZHOU LIQIN","U1520573H","SM2","SM2 (12 MTHS)","Single","IEM"]
[null,null,null,"JIANG WENBO","U1520574E","SM2","SM2 (12 MTHS)","Single","EEE"]
[null,null,null,"CHEN YUZONG","U1520575B","SM2","SM2 (12 MTHS)","Single","EEE"]
[null,null,null,"XIONG ZHIWEI","U1520576K","SM2","SM2 (12 MTHS)","Single","EEE"]
[null,null,null,"TANG XIONGYI","U1520578D","SM2","SM2 (12 MTHS)","Single","IEM"]
[null,null,null,"ZENG CHENXUAN","U1520580D","SM2","SM2 (12 MTHS)","Single","EEE"]
[null,null,null,"ZHAO CHANGLU","U1520581A","SM2","SM2 (12 MTHS)","Single","EEE"]
[null,null,null,"YANG CAN","U1520582J","SM2","SM2 (12 MTHS)","Single","CSC"]
[null,null,null,"ZHANG YUXUAN","U1520583F","SM2","SM2 (12 MTHS)","Single","CEE"]
[null,null,null,"HE YANCHAO","U1520584C","SM2","SM2 (12 MTHS)","Single","MAT"]
[null,null,null,"WEI BINGXUAN","U1520586H","SM2","SM2 (12 MTHS)","Single","EEE"]
[null,null,null,"LI WENRUI","U1520588B","SM2","SM2 (12 MTHS)","Single","MAT"]
[null,null,null,"XIONG LUOYUAN","U1520589K","SM2","SM2 (12 MTHS)","Single","EEE"]
[null,null,null,"ZHANG RONG","U1520590B","SM2","SM2 (12 MTHS)","Single","EEE"]
[null,null,null,"CHEN ZIQIU","U1520591K","SM2","SM2 (12 MTHS)","Single","EEE"]
[null,null,null,"WU RUIHUA","U1520592G","SM2","SM2 (12 MTHS)","Single","EEE"]
[null,null,null,"TANG SHUQIAN","U1520593D","SM2","SM2 (12 MTHS)","Single","CSC"]
[null,null,null,"YAO BOWEN","U1520594A","SM2","SM2 (12 MTHS)","Single","MS"]
[null,null,null,"YU CUNJUN","U1520595J","SM2","SM2 (12 MTHS)","Single","ME"]
[null,null,null,"CHEN YULING","U1520596F","SM2","SM2 (12 MTHS)","Single","EEE"]
[null,null,null,"HAN HONGYI","U1520597C","SM2","SM2 (12 MTHS)","Single","EEE"]
[null,null,null,"SHI YILIN","U1520598L","SM2","SM2 (12 MTHS)","Single","EEE"]
[null,null,null,"DENG YUE","U1520600L","SM2","SM2 (12 MTHS)","Single","CSC"]
[null,null,null,"LIU TIANCHI","U1520602E","SM2","SM2 (12 MTHS)","Single","CEE"]
[null,null,null,"PAN XINGMENG","U1520603B","SM2","SM2 (12 MTHS)","Single","EEE"]
[null,null,null,"GUO WEI","U1520604K","SM2","SM2 (12 MTHS)","Single","CSC"]
[null,null,null,"PENG HONGYI","U1520605G","SM2","SM2 (12 MTHS)","Single","EEE"]
[null,null,null,"FAN SIYANG","U1520606D","SM2","SM2 (12 MTHS)","Single","EEE"]
[null,null,null,"LUO RUIKANG","U1520607A","SM2","SM2 (12 MTHS)","Single","EEE"]
[null,null,null,"GAO YOUYOU","U1520608J","SM2","SM2 (12 MTHS)","Single","IEM"]
[null,null,null,"SHI CHENYU","U1520609F","SM2","SM2 (12 MTHS)",{"$f":"VLOOKUP(I$1:I$5281,$A$37:$B$212,2,FALSE)","v":"Single"},"IEM"]
[null,null,null,"ZHU DI","U1520610J","SM2","SM2 (12 MTHS)","Single","EEE"]
[null,null,null,"CUI SHENGPING","U1520611F","SM2","SM2 (12 MTHS)","Single","CSC"]
[null,null,null,"QI JINGYA","U1520612C","SM2","SM2 (12 MTHS)","Single","EEE"]
[null,null,null,"ZENG ZILING","U1520614H","SM2","SM2 (12 MTHS)","Single","CBE"]
[null,null,null,"HAO MEIRU","U1520615E","SM2","SM2 (12 MTHS)","Single","CSC"]
[null,null,null,"WANG ZHENYU","U1520616B","SM2","SM2 (12 MTHS)","Single","MS"]
[null,null,null,"SUN JIAJUN","U1520617K","SM2","SM2 (12 MTHS)","Single","EEE"]
[null,null,null,"ZHAI YUELIANG","U1520618G","SM2","SM2 (12 MTHS)","Single","EEE"]
[null,null,null,"WU RUIDA","U1520620G","SM2","SM2 (12 MTHS)","Single","EEE"]
[null,null,null,"WU DIYA","U1520621D","SM2","SM2 (12 MTHS)","Single","EEE"]
[null,null,null,"LIU LIUZIYI","U1520622A","SM2","SM2 (12 MTHS)","Single","EEE"]
[null,null,null,"BI JIANXIN","U1520623J","SM2","SM2 (12 MTHS)","Single","EEE"]
[null,null,null,"ZHANG XINYUE","U1520624F","SM2","SM2 (12 MTHS)","Single","EEE"]
[null,null,null,"LI QINGYAO","U1520625C","SM2","SM2 (12 MTHS)","Single","MS"]
[null,null,null,"DING JIN","U1520626L","SM2","SM2 (12 MTHS)","Single","EEE"]
[null,null,null,"ZHANG ZENG","U1520627H","SM2","SM2 (12 MTHS)","Single","EEE"]
[null,null,null,"ZHAO XINGE","U1520628E","SM2","SM2 (12 MTHS)","Single","CEE"]
[null,null,null,"HUANG SHUANGCHEN","U1520629B","SM2","SM2 (12 MTHS)","Single","EEE"]
[null,null,null,"GUO KEXIN","U1520630E","SM2","SM2 (12 MTHS)","Single","MAT"]
[null,null,null,"LIU MINGYUE","U1520632K","SM2","SM2 (12 MTHS)","Single","EEE"]
[null,null,null,"LIU YE","U1520633G","SM2","SM2 (12 MTHS)","Single","EEE"]
[null,null,null,"WANG ZIJIE","U1520634D","SM2","SM2 (12 MTHS)","Single","EEE"]
[null,null,null,"SU JUNXIN","U1520635A","SM2","SM2 (12 MTHS)","Single","EEE"]
[null,null,null,"CHEN HAILIN","U1520636J","SM2","SM2 (12 MTHS)","Single","CSC"]
[null,null,null,"REN JIAWEI","U1520637F","SM2","SM2 (12 MTHS)","Single","EEE"]
[null,null,null,"ZHOU JIAQI","U1520638C","SM2","SM2 (12 MTHS)","Single","EEE"]
[null,null,null,"TIAN YIYUN","U1520640C","SM2","SM2 (12 MTHS)","Single","ME"]
[null,null,null,"WEI XINYUE","U1520641L","SM2","SM2 (12 MTHS)","Single","MS"]
[null,null,null,"LI JIAHAO","U1520642H","SM2","SM2 (12 MTHS)","Single","EEE"]
[null,null,null,"LI JIAHANG","U1520643E","SM2","SM2 (12 MTHS)","Single","EEE"]
[null,null,null,"SHI ZIJI","U1520644B","SM2","SM2 (12 MTHS)","Single","CSC"]
[null,null,null,"ZHAO XIANGLING","U1520645K","SM2","SM2 (12 MTHS)","Single","IEM"]
[null,null,null,"LU ZHENYUAN","U1520646G","SM2","SM2 (12 MTHS)","Single","EEE"]
[null,null,null,"HU JUNTIAN","U1520648A","SM2","SM2 (12 MTHS)","Single","EEE"]
[null,null,null,"CAO WENFEI","U1520649J","SM2","SM2 (12 MTHS)","Single","MS"]
[null,null,null,"PAN ZEXU","U1520670H","SM2","SM2 (12 MTHS)","Single","EEE"]
[null,null,null,"YU TIAN","U1520697E","SM2","SM2 (12 MTHS)","Single","EEE"]
[null,null,null,"LU ZHEN","U1520701K","SM2","SM2 (12 MTHS)","Single","ME"]
[null,null,null,"SHI GANYU","U1520703D","SM2","SM2 (12 MTHS)","Single","CSC"]
[null,null,null,"DONG AIQING","U1520734F","SM2","SM2 (12 MTHS)","Double (Type 1)","BCG"]
[null,null,null,"WANG JINGBIN","U1520764L","SM2","SM2 (12 MTHS)","Single","AERO"]
[null,null,null,"PAN JIACONG","U1520769G","SM2","SM2 (12 MTHS)","Single","CE"]
[null,null,null,"LI WEIHAO","U1520851B","SM2","SM2 (12 MTHS)","Single","MAT"]
[null,null,null,"WU ZHENGHAO","U1520927C","SM2","SM2 (12 MTHS)","Single","CSC"]
[null,null,null,"ZHOU YUNQI","U1520962K","SM2","SM2 (12 MTHS)","Single","ENE"]
[null,null,null,"ZHOU LINGJIN","U1521195D","SM2","SM2 (12 MTHS)","Single","AERO"]
[null,null,null,"CAI LINGFENG","U1521221K","SM2","SM2 (12 MTHS)","Single","MAT"]
[null,null,null,"CAI ZHONGANG","U1521256L","SM2","SM2 (12 MTHS)","Single","AERO"]
[null,null,null,"GUPTA DIVYANSH","U1521786D",null,"No bridging","Single","CSC"]
[null,null,null,"XIAO LINGZI","U1521996F","MOE PreU Scholar (PRC)","No bridging","Single","MS"]
[null,null,null,"RAWAL AKSHAY","U1522163H","SIA Youth","No bridging","Double (Type 1)","BCG"]
[null,null,null,"HITESH SHAH HEMANG","U1522251G",null,"No bridging","Single","EEE"]
[null,null,null,"MARATHE AJINKYA AVINASH","U1522716K",null,"No bridging","Single","CSC"]
[null,null,null,"WU QINXIN","U1522835L","SM2","SM2 (12 MTHS)","Single","CSC"]
[null,null,null,"SHARMA VIDUR","U1522940D",null,"No bridging","Single","CSC"]
[null,null,null,"VENKATARAMANI ASHWIN BALAJI","U1522980G",null,"No bridging","Single","EEE"]
[null,null,null,"LIN ZIWEN","U1540105E","SM2","SM2 (12 MTHS)","Single","MATH"]
[null,null,null,"XU BOXIAO","U1540106B","SM2","SM2 (12 MTHS)","Single","MAEC"]
[null,null,null,"WANG SONG","U1540107K","SM2","SM2 (12 MTHS)","Single","MAEC"]
[null,null,null,"XIN LUYIN","U1540108G","SM2","SM2 (12 MTHS)","Single","MATH"]
[null,null,null,"LU SIYAO","U1540109D","SM2","SM2 (12 MTHS)","Single","MATH"]
[null,null,null,"WEN YUANYUAN","U1540110G","SM2","SM2 (12 MTHS)","Single","MAEC"]
[null,null,null,"JIN YE","U1540111D","SM2","SM2 (12 MTHS)","Single","MAEC"]
[null,null,null,"XIAO FENGTONG","U1540112A","SM2","SM2 (12 MTHS)",{"$f":"VLOOKUP(I$1:I$5281,$A$37:$B$212,2,FALSE)","v":"Single"},"MATH"]
[null,null,null,"ZHANG CHUCHU","U1540113J","SM2","SM2 (12 MTHS)","Single","MATH"]
[null,null,null,"SHEN JIANXIN","U1540114F","SM2","SM2 (12 MTHS)","Single","PHY"]
[null,null,null,"LI JINGYI","U1540116L","SM2","SM2 (12 MTHS)","Single","MAEC"]
[null,null,null,"BIAN TINGBIN","U1540118E","SM2","SM2 (12 MTHS)","Single","MAEC"]
[null,null,null,"SU HENG","U1540120E","SM2","SM2 (12 MTHS)","Single","MAEC"]
[null,null,null,"ZHANG HONGDUO","U1540121B","SM2","SM2 (12 MTHS)","Single","MAEC"]
[null,null,null,"SHEN YIXIAO","U1540122K","SM2","SM2 (12 MTHS)","Single","CHEM"]
[null,null,null,"GUO YUEWEN","U1540123G","SM2","SM2 (12 MTHS)","Single","MATH"]
[null,null,null,"LYU XINGYU","U1540124D","SM2","SM2 (12 MTHS)","Single","MAEC"]
[null,null,null,"CHEN ZITONG","U1540125A","SM2","SM2 (12 MTHS)","Single","MATH"]
[null,null,null,"XIONG ZHIYUAN","U1540126J","SM2","SM2 (12 MTHS)","Single","MATH"]
[null,null,null,"FANG SHIYUAN","U1540137D","SM2","SM2 (12 MTHS)","Single","EESS"]
[null,null,null,"CHEN ZHICHAO","U1540389C","SM2","SM2 (12 MTHS)","Single","BS"]
[null,null,null,"ZENG JINPO","U1620575J","MOE PreU Scholar (PRC)","No bridging","Double (Type 1)","BCG"]
[null,null,null,"LIU TIANYI","U1620581H","MOE PreU Scholar (PRC)","No bridging","Single","MAT"]
[null,null,null,"TIAN YUJIA","U1620903D","MOE PreU Scholar (PRC)","No bridging","Single","AERO"]
[null,null,null,"FANG MEIYI","U1620919F","MOE PreU Scholar (PRC)","No bridging","Single","CSC"]
[null,null,null,"TANG JIAYUN","U1621004H","MOE PreU Scholar (PRC)","No bridging","Single","CSC"]
[null,null,null,"ZHOU WENHAO","U1621028C","MOE PreU Scholar (PRC)","No bridging","Single","CBE"]
[null,null,null,"LIU HAO","U1621076K","MOE PreU Scholar (PRC)","No bridging","Single","CBE"]
[null,null,null,"SHI YUXIN","U1621078D","MOE PreU Scholar (PRC)","No bridging","Single","CSC"]
[null,null,null,"LYU XINTONG","U1621112C","MOE PreU Scholar (PRC)","No bridging","Double (Type 1)","BCG"]
[null,null,null,"REN CAOYUE","U1621160K","MOE PreU Scholar (PRC)","No bridging","Single","MS"]
[null,null,null,"HE YUCHEN","U1621196H","MOE PreU Scholar (PRC)","No bridging","Single","EEE"]
[null,null,null,"MA ZHONGNAN","U1621213B","MOE PreU Scholar (PRC)","No bridging","Single","EEE"]
[null,null,null,"WANG YIXUAN","U1621252H","MOE PreU Scholar (PRC)","No bridging","Single","CBE"]
[null,null,null,"YI ZIRONG","U1621431H","MOE PreU Scholar (PRC)","No bridging","Single","CBE"]
[null,null,null,"ZHANG SIYUAN","U1621441F","MOE PreU Scholar (PRC)","No bridging","Single","EEE"]
[null,null,null,"ZHOU MANQI","U1621561D","MOE PreU Scholar (PRC)","No bridging","Single","MS"]
[null,null,null,"LI YIHENG","U1621626K","MOE PreU Scholar (PRC)","No bridging","Single","EEE"]
[null,null,null,"ZHAO TIANQI","U1621695K","MOE PreU Scholar (PRC)","No bridging","Single","EEE"]
[null,null,null,"GURUMURTHY VARSHA","U1621700A","SIA Youth","No bridging","Single","CBE"]
[null,null,null,"XU PEISEN","U1622073L","SM2","SM2 (12 MTHS)","Single","IEM"]
[null,null,null,"QIN YIFAN","U1622083J","SM2","SM2 (12 MTHS)","Single","EEE"]
[null,null,null,"UNNAVA VENKATA RAMANA NITIN","U1622086L","SIA Youth","No bridging","Single","MAT"]
[null,null,null,"XU LITE","U1622096J","SM2","SM2 (12 MTHS)","Single","EEE"]
[null,null,null,"LU LIN","U1622101L","SM2","SM2 (12 MTHS)","Single","ME"]
[null,null,null,"LUO ZIWANG","U1622112F","SM2","SM2 (12 MTHS)","Single","EEE"]
[null,null,null,"CHEN XIZI","U1622115H","SM2","SM2 (12 MTHS)","Single","ME"]
[null,null,null,"MA YUQIAN","U1622117B","SM2","SM2 (12 MTHS)","Single","CSC"]
[null,null,null,"ZHANG XINYE","U1622118K","SM2","SM2 (12 MTHS)","Single","CSC"]
[null,null,null,"ZHU HAOYU","U1622119G","SM2","SM2 (12 MTHS)","Single","EEE"]
[null,null,null,"LI YUENAN","U1622121G","SM2","SM2 (12 MTHS)","Single","CEE"]
[null,null,null,"XU YAN","U1622122D","SM2","SM2 (12 MTHS)","Single","ME"]
[null,null,null,"XIE ZHAOQING","U1622123A","SM2","SM2 (12 MTHS)","Single","CEE"]
[null,null,null,"XIONG YIJING","U1622125F","SM2","SM2 (12 MTHS)","Single","ME"]
[null,null,null,"YU XI","U1622126C","SM2","SM2 (12 MTHS)","Single","CBE"]
[null,null,null,"LANG ZIHUI","U1622127L","SM2","SM2 (12 MTHS)","Single","EEE"]
[null,null,null,"GUO HUIMIN","U1622128H","SM2","SM2 (12 MTHS)","Single","EEE"]
[null,null,null,"DAI YUFENG","U1622129E","SM2","SM2 (12 MTHS)","Single","CBE"]
[null,null,null,"LAN HAOCHONG","U1622131E","SM2","SM2 (12 MTHS)","Single","EEE"]
[null,null,null,"CAO LIU","U1622132B","SM2","SM2 (12 MTHS)","Single","CSC"]
[null,null,null,"WEI ZUOLI","U1622133K","SM2","SM2 (12 MTHS)","Single","EEE"]
[null,null,null,"CHEN JINGHUAN","U1622134G","SM2","SM2 (12 MTHS)","Single","EEE"]
[null,null,null,"FENG SHIHAO","U1622136A","SM2","SM2 (12 MTHS)","Single","EEE"]
[null,null,null,"CAI SHUHAN","U1622137J","SM2","SM2 (12 MTHS)","Single","CBE"]
[null,null,null,"YUE KUNLUN","U1622138F","SM2","SM2 (12 MTHS)","Single","EEE"]
[null,null,null,"QIU HAOZE","U1622139C","SM2","SM2 (12 MTHS)","Single","CSC"]
[null,null,null,"XIE ZHUOFAN","U1622140F","SM2","SM2 (12 MTHS)","Single","EEE"]
[null,null,null,"WU SIJIE","U1622141C","SM2","SM2 (12 MTHS)","Single","ME"]
[null,null,null,"DING JIAWEN","U1622142L","SM2","SM2 (12 MTHS)","Single","EEE"]
[null,null,null,"LIU FANGBING","U1622143H","SM2","SM2 (12 MTHS)","Single","CSC"]
[null,null,null,"ZHU ZHIMO","U1622144E","SM2","SM2 (12 MTHS)","Single","EEE"]
[null,null,null,"LI XINTONG","U1622145B","SM2","SM2 (12 MTHS)",{"$f":"VLOOKUP(I$1:I$5281,$A$37:$B$212,2,FALSE)","v":"Single"},"IEM"]
[null,null,null,"HE JUNSEN","U1622146K","SM2","SM2 (12 MTHS)","Single","EEE"]
[null,null,null,"DI TINGJIAN","U1622147G","SM2","SM2 (12 MTHS)","Single","EEE"]
[null,null,null,"WEI YIJIAN","U1622148D","SM2","SM2 (12 MTHS)","Single","EEE"]
[null,null,null,"LIU ZIMING","U1622149A","SM2","SM2 (12 MTHS)","Single","EEE"]
[null,null,null,"LI NIAN","U1622150D","SM2","SM2 (12 MTHS)","Single","EEE"]
[null,null,null,"HOU XINYU","U1622151A","SM2","SM2 (12 MTHS)","Single","EEE"]
[null,null,null,"WU CHENGZHI","U1622152J","SM2","SM2 (12 MTHS)","Single","CEE"]
[null,null,null,"KONG LINGXUAN","U1622153F","SM2","SM2 (12 MTHS)","Single","CBE"]
[null,null,null,"WU NUOXIN","U1622154C","SM2","SM2 (12 MTHS)","Single","CEE"]
[null,null,null,"QING ZHUMING","U1622156H","SM2","SM2 (12 MTHS)","Single","ENE"]
[null,null,null,"FAN WENXUAN","U1622158B","SM2","SM2 (12 MTHS)","Single","CBE"]
[null,null,null,"ZHANG BIN","U1622159K","SM2","SM2 (12 MTHS)","Single","CSC"]
[null,null,null,"RUAN DEZHENG","U1622160B","SM2","SM2 (12 MTHS)","Single","MS"]
[null,null,null,"CAO HANNAN","U1622161K","SM2","SM2 (12 MTHS)","Single","CSC"]
[null,null,null,"CHEN TIANRUI","U1622162G","SM2","SM2 (12 MTHS)","Single","IEM"]
[null,null,null,"HU JINGYI","U1622163D","SM2","SM2 (12 MTHS)","Single","EEE"]
[null,null,null,"CHEN ZHIYUAN","U1622164A","SM2","SM2 (12 MTHS)","Single","CBE"]
[null,null,null,"SHEN YOULIN","U1622165J","SM2","SM2 (12 MTHS)","Single","CSC"]
[null,null,null,"WANG TAIGE","U1622166F","SM2","SM2 (12 MTHS)","Single","EEE"]
[null,null,null,"ZHU JIANFEI","U1622167C","SM2","SM2 (12 MTHS)","Single","MATH"]
[null,null,null,"WU BIAN","U1622168L","SM2","SM2 (12 MTHS)","Single","CSC"]
[null,null,null,"ZHANG XINCAI","U1622169H","SM2","SM2 (12 MTHS)","Single","EEE"]
[null,null,null,"HU WENYANG","U1622170L","SM2","SM2 (12 MTHS)","Single","EEE"]
[null,null,null,"HUANGFU QINGCHUAN","U1622171H","SM2","SM2 (12 MTHS)","Single","CSC"]
[null,null,null,"ZHOU YIXIN","U1622172E","SM2","SM2 (12 MTHS)","Single","EEE"]
[null,null,null,"LIU YUAN","U1622173B","SM2","SM2 (12 MTHS)","Single","EEE"]
[null,null,null,"QIANG JIATAI","U1622174K","SM2","SM2 (12 MTHS)","Single","CSC"]
[null,null,null,"XIAO SIJIA","U1622175G","SM2","SM2 (12 MTHS)","Single","IEM"]
[null,null,null,"SONG RUI","U1622176D","SM2","SM2 (12 MTHS)","Single","MS"]
[null,null,null,"Tang Zimo","U1622177A","SM2","SM2 (12 MTHS)","Single","MATH"]
[null,null,null,"WU XIANYUE","U1622178J","SM2","SM2 (12 MTHS)","Single","CBE"]
[null,null,null,"WANG TONG","U1622180J","SM2","SM2 (12 MTHS)","Single","EEE"]
[null,null,null,"GAO RUIHAN","U1622182C","SM2","SM2 (12 MTHS)","Single","EEE"]
[null,null,null,"WANG QILE","U1622183L","SM2","SM2 (12 MTHS)","Single","ME"]
[null,null,null,"CAI LINGZHI","U1622184H","SM2","SM2 (12 MTHS)","Single","CSC"]
[null,null,null,"LI SHANLAN","U1622186B","SM2","SM2 (12 MTHS)","Single","CSC"]
[null,null,null,"CHEN CHONGSONG","U1622187K","SM2","SM2 (12 MTHS)","Single","CSC"]
[null,null,null,"QIAO GUANHENG","U1622189D","SM2","SM2 (12 MTHS)","Single","EEE"]
[null,null,null,"XU JING","U1622191D","SM2","SM2 (12 MTHS)","Single","EEE"]
[null,null,null,"LI ZEHAO","U1622192A","SM2","SM2 (12 MTHS)","Single","EEE"]
[null,null,null,"WU XI","U1622193J","SM2","SM2 (12 MTHS)","Single","IEM"]
[null,null,null,"ZHANG RUOLANGXING","U1622194F","SM2","SM2 (12 MTHS)","Single","IEM"]
[null,null,null,"XIONG HAITAO","U1622195C","SM2","SM2 (12 MTHS)","Single","EEE"]
[null,null,null,"PANG YUJIN","U1622196L","SM2","SM2 (12 MTHS)","Single","EEE"]
[null,null,null,"ZHOU XUWEN","U1622197H","SM2","SM2 (12 MTHS)","Single","EEE"]
[null,null,null,"GUO ZIXUN","U1622198E","SM2","SM2 (12 MTHS)","Single","EEE"]
[null,null,null,"WANG SIFAN","U1622199B","SM2","SM2 (12 MTHS)","Single","EEE"]
[null,null,null,"DENG JIACHENG","U1622200E","SM2","SM2 (12 MTHS)","Single","EEE"]
[null,null,null,"HU SHUYI","U1622201B","SM2","SM2 (12 MTHS)","Single","EEE"]
[null,null,null,"LIU MINGYU","U1622202K","SM2","SM2 (12 MTHS)","Single","CSC"]
[null,null,null,"WANG KEXIN","U1622203G","SM2","SM2 (12 MTHS)","Single","EEE"]
[null,null,null,"HUANG XINWEI","U1622204D","SM2","SM2 (12 MTHS)","Single","IEM"]
[null,null,null,"ZHANG HAOSONG","U1622205A","SM2","SM2 (12 MTHS)","Single","EEE"]
[null,null,null,"WU CHUQIAO","U1622207F","SM2","SM2 (12 MTHS)","Single","IEM"]
[null,null,null,"REN JINGFEI","U1622208C","SM2","SM2 (12 MTHS)","Single","MAT"]
[null,null,null,"ZHAO MENGHAN","U1622210C","SM2","SM2 (12 MTHS)","Single","MS"]
[null,null,null,"BAI YEQI","U1622212H","SM2","SM2 (12 MTHS)","Single","EEE"]
[null,null,null,"LIANG CE","U1622222F","SM2","SM2 (12 MTHS)","Single","IEM"]
[null,null,null,"WU ZIQING","U1622342D","MOE PreU Scholar (PRC)","No bridging","Double (Type 1)","BCG"]
[null,null,null,"WU HAO","U1622384A","MOE PreU Scholar (PRC)","No bridging","Single","CSC"]
[null,null,null,"TU ANQI","U1622399F","MOE PreU Scholar (PRC)","No bridging","Double (Type 1)","BCG"]
[null,null,null,"QIAN KAIZHU","U1622475B","MOE PreU Scholar (PRC)","No bridging","Single","CBE"]
[null,null,null,"WU LUE","U1622508J","MOE PreU Scholar (PRC)","No bridging","Single","CSC"]
[null,null,null,"DONG WEIEN","U1622796A","MOE PreU Scholar (PRC)","No bridging",{"$f":"VLOOKUP(I$1:I$5281,$A$37:$B$212,2,FALSE)","v":"Single"},"EEE"]
[null,null,null,"DATTA ADITYA KANTI","U1622900H","Direct","No bridging","Single","CBE"]
[null,null,null,"LIU DEREN","U1640258F","MOE PreU Scholar (PRC)","No bridging","Single","PHY"]
[null,null,null,"XIANG XINYU","U1640682D","MOE PreU Scholar (PRC)","No bridging","Single","BS"]
[null,null,null,"XU YANBIN","U1640689E","SM2","SM2 (12 MTHS)","Single","MATH"]
[null,null,null,"YAO YUETONG","U1640710D","SM2","SM2 (12 MTHS)","Single","MATH"]
[null,null,null,"LIU BINGYAN","U1640711A","SM2","SM2 (12 MTHS)","Single","MAEC"]
[null,null,null,"WU MEIXI","U1640712J","SM2","SM2 (12 MTHS)","Single","MAEC"]
[null,null,null,"LIN YUQING","U1640713F","SM2","SM2 (12 MTHS)","Single","MAEC"]
[null,null,null,"HU XINMAI","U1640714C","SM2","SM2 (12 MTHS)","Single","MAEC"]
[null,null,null,"LIU HUILUN","U1640715L","SM2","SM2 (12 MTHS)","Single","MAEC"]
[null,null,null,"XU XINYI","U1640716H","SM2","SM2 (12 MTHS)","Single","MAEC"]
[null,null,null,"LEI JINGYUAN","U1640717E","SM2","SM2 (12 MTHS)","Single","BS"]
[null,null,null,"XIE MENGYI","U1640718B","SM2","SM2 (12 MTHS)","Single","MATH"]
[null,null,null,"SHI LUOZI","U1640719K","SM2","SM2 (12 MTHS)","Single","MATH"]
[null,null,null,"YI BOHUI","U1640720B","SM2","SM2 (12 MTHS)","Single","MATH"]
[null,null,null,"MA HONGXUAN","U1640722G","SM2","SM2 (12 MTHS)","Single","MATH"]
[null,null,null,"HU YAXI","U1640723D","SM2","SM2 (12 MTHS)","Single","MAEC"]
[null,null,null,"DOU YAO","U1640724A","SM2","SM2 (12 MTHS)","Single","MAEC"]
[null,null,null,"SHI QI","U1640725J","SM2","SM2 (12 MTHS)","Single","CHEM"]
[null,null,null,"LI QINYU","U1640726F","SM2","SM2 (12 MTHS)","Single","MATH"]
[null,null,null,"WANG ZHUOJUN","U1640727C","SM2","SM2 (12 MTHS)","Single","MATH"]
[null,null,null,"SUN BOHAO","U1640728L","SM2","SM2 (12 MTHS)","Single","MATH"]
[null,null,null,"WANG QI","U1640730L","SM2","SM2 (12 MTHS)","Single","MATH"]
[null,null,null,"CHEN GUIZHEN","U1640854H","MOE PreU Scholar (PRC)","No bridging","Single","MATH"]
[null,null,null,"LI ZHAOCHEN","U1720279L","MOE PreU Scholar (PRC)","No bridging","Single","CSC"]
[null,null,null,"LYU ZIZHENG","U1720497H","MOE PreU Scholar (PRC)","No bridging","Single","CE"]
[null,null,null,"LI YINGCHEN","U1720677F","MOE PreU Scholar (PRC)","No bridging","Single","EEE"]
[null,null,null,"HUANG PENG","U1720694G","MOE PreU Scholar (PRC)","No bridging","Double (Type 1)","BCG"]
[null,null,null,"LI YUTING","U1720729F","MOE PreU Scholar (PRC)","No bridging","Double (Type 1)","BCG"]
[null,null,null,"CHEN PING","U1720809G","MOE PreU Scholar (PRC)","No bridging","Single","CSC"]
[null,null,null,"WU WENXUAN","U1720945K","MOE PreU Scholar (PRC)","No bridging","Double (Type 1)","BCG"]
[null,null,null,"NIU JIANAN","U1720995L","MOE PreU Scholar (PRC)","No bridging","Single","CSC"]
[null,null,null,"TAJUDEEN SAFEEK AHMED","U1721140E",null,"No bridging","Single","CSC"]
[null,null,null,"PENG YI","U1721186J","MOE PreU Scholar (PRC)","No bridging","Single","IEM"]
[null,null,null,"AN ZHEYUAN","U1721480K","MOE PreU Scholar (PRC)","No bridging","Single","CSC"]
[null,null,null,"SUN RUIJIA","U1721550B","MOE PreU Scholar (PRC)","No bridging","Single","MAT"]
[null,null,null,"XING WANTING","U1721577A","MOE PreU Scholar (PRC)","No bridging","Single","CSC"]
[null,null,null,"WANG DAINI","U1721818F","MOE PreU Scholar (PRC)","No bridging","Single","CSC"]
[null,null,null,"WANG XIAOYU","U1721992H","MOE PreU Scholar (PRC)","No bridging","Double (Type 1)","BCG"]
[null,null,null,"LI MENGYANG","U1722005G","SM2","SM2 (12 MTHS)","Single","IEM"]
[null,null,null,"LU PEIYI","U1722013A","SM2","SM2 (12 MTHS)","Single","ME"]
[null,null,null,"ZHANG SHENGJING","U1722023K","SM2","SM2 (12 MTHS)","Single","CSC"]
[null,null,null,"YANG KAIYI","U1722025C","SM2","SM2 (12 MTHS)","Single","EEE"]
[null,null,null,"LI GUANLONG","U1722033H","SM2","SM2 (12 MTHS)","Single","CSC"]
[null,null,null,"HAN XIHAO","U1722042D","SM2","SM2 (12 MTHS)","Single","IEM"]
[null,null,null,"XING TONG","U1722043F","SM2","SM2 (12 MTHS)","Single","EEE"]
[null,null,null,"JIA XIAOCHEN","U1722044H","SM2","SM2 (12 MTHS)","Single","CSC"]
[null,null,null,"OUYANG WENJUN","U1722052B","SM2","SM2 (12 MTHS)","Single","EEE"]
[null,null,null,"JIANG YUNXIANG","U1722082G","SM2","SM2 (12 MTHS)","Single","ME"]
[null,null,null,"FENG DAIFEI","U1722091C","MOE PreU Scholar (PRC)","No bridging","Double (Type 1)","BCG"]
[null,null,null,"JIANG YI","U1722092E","SM2","SM2 (12 MTHS)","Single","ME"]
[null,null,null,"YAN KAIZHEN","U1722104B","SM2","SM2 (12 MTHS)","Single","IEM"]
[null,null,null,"ZHANG JIARUI","U1722105D","SM2","SM2 (12 MTHS)","Single","EEE"]
[null,null,null,"MU SIYI","U1722115B","SM2","SM2 (12 MTHS)","Single","CSC"]
[null,null,null,"MA LING","U1722123G","SM2","SM2 (12 MTHS)","Single","EEE"]
[null,null,null,"LIU YUE","U1722142A","SM2","SM2 (12 MTHS)","Single","EEE"]
[null,null,null,"WEN XIBO","U1722143C","SM2","SM2 (12 MTHS)","Single","EEE"]
[null,null,null,"CAI ZIHUI","U1722172F","SM2","SM2 (12 MTHS)","Single","EEE"]
[null,null,null,"CHEN FEIYU","U1722182D","SM2","SM2 (12 MTHS)","Single","CSC"]
[null,null,null,"YANG JINGYI","U1722192B","SM2","SM2 (12 MTHS)","Single","CSC"]
[null,null,null,"SUN RUI","U1722203H","SM2","SM2 (12 MTHS)","Single","BIE"]
[null,null,null,"CAO TIANCHENG","U1722224F","SM2","SM2 (12 MTHS)","Single","EEE"]
[null,null,null,"QIN ZIHAO","U1722242J","SM2","SM2 (12 MTHS)","Single","EEE"]
[null,null,null,"BAHETI VEEBHAV","U1722247H",null,"No bridging",{"$f":"VLOOKUP(I$1:I$5281,$A$37:$B$212,2,FALSE)","v":"Single"},"EEE"]
[null,null,null,"ZHANG JIAYU","U1722252G","SM2","SM2 (12 MTHS)","Single","IEM"]
[null,null,null,"RAO PEILIN","U1722253J","SM2","SM2 (12 MTHS)","Single","CBE"]
[null,null,null,"CHEN XIAOYU","U1722262E","SM2","SM2 (12 MTHS)","Single","EEE"]
[null,null,null,"SHA WEIJIA","U1722272C","SM2","SM2 (12 MTHS)","Single","EEE"]
[null,null,null,"HAN JIAQI","U1722273E","SM2","SM2 (12 MTHS)","Single","EEE"]
[null,null,null,"YONG HAO","U1722282A","SM2","SM2 (12 MTHS)","Single","CSC"]
[null,null,null,"LIU AOHAN","U1722283C","SM2","SM2 (12 MTHS)","Single","ME"]
[null,null,null,"LIU WENHAN","U1722292K","SM2","SM2 (12 MTHS)","Single","EEE"]
[null,null,null,"WANG HANYU","U1722293A","SM2","SM2 (12 MTHS)","Single","EEE"]
[null,null,null,"BEDI JANNAT","U1722297J",null,"No bridging","Single","CSC"]
[null,null,null,"THOMAS STEPHEN FELIX","U1722308D",null,"No bridging","Single","CE"]
[null,null,null,"LI SHENGGUI","U1722315G","MOE PreU Scholar (PRC)","No bridging","Single","CSC"]
[null,null,null,"SONG CHUQI","U1722323A","SM2","SM2 (12 MTHS)","Single","IEM"]
[null,null,null,"LI JICHENG","U1722325E","SM2","SM2 (12 MTHS)","Single","ME"]
[null,null,null,"HUANG SHURUI","U1722333K","SM2","SM2 (12 MTHS)","Single","ME"]
[null,null,null,"CHEN CHENG","U1722345A","MOE PreU Scholar (PRC)","No bridging","Single","CSC"]
[null,null,null,"XIE JIAHAO","U1722352D","SM2","SM2 (12 MTHS)","Single","MAT"]
[null,null,null,"HE ZHANXIN","U1722362B","SM2","SM2 (12 MTHS)","Single","ME"]
[null,null,null,"GUO ZHIWEI","U1722372L","SM2","SM2 (12 MTHS)","Single","CSC"]
[null,null,null,"SHAN SHILIN","U1722374D","SM2","SM2 (12 MTHS)","Single","ME"]
[null,null,null,"CAO YANGYI","U1722382J","SM2","SM2 (12 MTHS)","Single","MS"]
[null,null,null,"FU HANQI","U1722392G","SM2","SM2 (12 MTHS)","Single","ME"]
[null,null,null,"WAN ZIQING","U1722403B","SM2","SM2 (12 MTHS)","Single","EEE"]
[null,null,null,"LIAO YAN","U1722413L","SM2","SM2 (12 MTHS)","Single","EEE"]
[null,null,null,"PI ZIYI","U1722423J","SM2","SM2 (12 MTHS)","Single","EEE"]
[null,null,null,"MIAO WEIYANG","U1722425B","SM2","SM2 (12 MTHS)","Single","EEE"]
[null,null,null,"WU ZIANG","U1722432E","SM2","SM2 (12 MTHS)","Single","CSC"]
[null,null,null,"CHEN LEQUN","U1722442C","SM2","SM2 (12 MTHS)","Single","ME"]
[null,null,null,"CHENG ZHIAO","U1722444G","SM2","SM2 (12 MTHS)","Single","EEE"]
[null,null,null,"WANG SHAOPENG","U1722452A","SM2","SM2 (12 MTHS)","Single","CBE"]
[null,null,null,"CHEN YINYA","U1722474A","SM2","SM2 (12 MTHS)","Single","CSC"]
[null,null,null,"DANGI SIDDHARTH HASITKUMAR","U1722508J",null,"No bridging","Single","CBE"]
[null,null,null,"LI DONGRUI","U1722523F","SM2","SM2 (12 MTHS)","Single","EEE"]
[null,null,null,"HE ZILONG","U1722532B","SM2","SM2 (12 MTHS)","Single","ME"]
[null,null,null,"WANG ZHENG","U1722542L","SM2","SM2 (12 MTHS)","Single","CBE"]
[null,null,null,"MA SHUYU","U1722545F","SM2","SM2 (12 MTHS)","Single","IEM"]
[null,null,null,"ZHOU XIANGYU","U1722552J","SM2","SM2 (12 MTHS)","Single","ME"]
[null,null,null,"JIANG QI","U1722562G","SM2","SM2 (12 MTHS)","Single","EEE"]
[null,null,null,"XIONG HEYUHANG","U1722572E","SM2","SM2 (12 MTHS)","Single","EEE"]
[null,null,null,"CHEN TAOYU","U1722582C","SM2","SM2 (12 MTHS)","Single","CSC"]
[null,null,null,"HUANG ZHILIN","U1722603G","SM2","SM2 (12 MTHS)","Single","CSC"]
[null,null,null,"LI YAN","U1722604J","MOE PreU Scholar (PRC)","No bridging","Double (Type 1)","BCG"]
[null,null,null,"WANG ZIJIAN","U1722613E","SM2","SM2 (12 MTHS)","Single","CSC"]
[null,null,null,"HU XINYUE","U1722614G","SM2","SM2 (12 MTHS)","Single","MS"]
[null,null,null,"LI YUANMING","U1722615J","SM2","SM2 (12 MTHS)","Single","CE"]
[null,null,null,"TAO SHUAILIN","U1722624E","SM2","SM2 (12 MTHS)","Single","ME"]
[null,null,null,"HU JIAMI","U1722632K","SM2","SM2 (12 MTHS)","Single","EEE"]
[null,null,null,"CAO SHUXIN","U1722633A","SM2","SM2 (12 MTHS)","Single","EEE"]
[null,null,null,"YAO JINYU","U1722634C","SM2","SM2 (12 MTHS)","Single","EEE"]
[null,null,null,"SHAO BOLING","U1722642H","SM2","SM2 (12 MTHS)","Single","ME"]
[null,null,null,"XIE YUAN","U1722652F","SM2","SM2 (12 MTHS)","Single","EEE"]
[null,null,null,"ZHOU HONGYU","U1722662D","SM2","SM2 (12 MTHS)","Single","CSC"]
[null,null,null,"CHENG BOYA","U1722663F","SM2","SM2 (12 MTHS)","Single","CSC"]
[null,null,null,"TANG YUAN","U1722672B","SM2","SM2 (12 MTHS)","Single","EEE"]
[null,null,null,"HU JINHAI","U1722673D","SM2","SM2 (12 MTHS)","Single","EEE"]
[null,null,null,"PENG LUOCHENG","U1722703D","SM2","SM2 (12 MTHS)","Single","CSC"]
[null,null,null,"LI YIFAN","U1722713B","SM2","SM2 (12 MTHS)","Single","CBE"]
[null,null,null,"HAN SIMENG","U1722715F","SM2","SM2 (12 MTHS)","Single","CSC"]
[null,null,null,"LUO JINQI","U1722733J","SM2","SM2 (12 MTHS)","Single","CSC"]
[null,null,null,"KANT MANNAN","U1722737F",null,"No bridging","Single","CSC"]
[null,null,null,"LUO JIXIN","U1722742E","SM2","SM2 (12 MTHS)","Single","ME"]
[null,null,null,"LIU ZHIHENG","U1722743G","SM2","SM2 (12 MTHS)","Single","EEE"]
[null,null,null,"WU GUAN","U1722753E","SM2","SM2 (12 MTHS)","Single","EEE"]
[null,null,null,"ZHU JUNPING","U1722762A","SM2","SM2 (12 MTHS)",{"$f":"VLOOKUP(I$1:I$5281,$A$37:$B$212,2,FALSE)","v":"Single"},"AERO"]
[null,null,null,"GUO MUKUN","U1722782H","SM2","SM2 (12 MTHS)","Single","CSC"]
[null,null,null,"LI BINGZI","U1722793H","SM2","SM2 (12 MTHS)","Single","CSC"]
[null,null,null,"BHAGWAT ABHISHEK","U1722796C",null,"No bridging","Single","CSC"]
[null,null,null,"HE ZIWEI","U1722803A","SM2","SM2 (12 MTHS)","Single","IEM"]
[null,null,null,"TIAN TIAN","U1722813K","SM2","SM2 (12 MTHS)","Single","EEE"]
[null,null,null,"PENG JIAWEI","U1722814A","SM2","SM2 (12 MTHS)","Single","EEE"]
[null,null,null,"YIN DAIYING","U1722815C","SM2","SM2 (12 MTHS)","Single","MATH"]
[null,null,null,"LUO JINGYING","U1722823H","SM2","SM2 (12 MTHS)","Single","IEM"]
[null,null,null,"GUO SHUHAN","U1722832D","SM2","SM2 (12 MTHS)","Single","IEM"]
[null,null,null,"ADDI DEBASHREE","U1722837C",null,"No bridging","Single","CSC"]
[null,null,null,"HU LITAO","U1722842B","SM2","SM2 (12 MTHS)","Single","EEE"]
[null,null,null,"ZENG ZIYAO","U1722852L","SM2","SM2 (12 MTHS)","Single","EEE"]
[null,null,null,"ZHANG XINYUAN","U1722853B","SM2","SM2 (12 MTHS)","Single","EEE"]
[null,null,null,"ZHANG YUEHAN","U1722863L","SM2","SM2 (12 MTHS)","Single","CSC"]
[null,null,null,"ZENG YANXI","U1722874L","MOE PreU Scholar (PRC)","No bridging","Single","CSC"]
[null,null,null,"CHEN ZHUORAN","U1722882E","SM2","SM2 (12 MTHS)","Single","CE"]
[null,null,null,"LIAO CHANG","U1722904L","SM2","SM2 (12 MTHS)","Single","EEE"]
[null,null,null,"LIU XINGYE","U1722905B","SM2","SM2 (12 MTHS)","Single","CSC"]
[null,null,null,"WANG XINZHU","U1722914J","SM2","SM2 (12 MTHS)","Single","CBE"]
[null,null,null,"HE WEIYANG","U1722932A","SM2","SM2 (12 MTHS)","Single","EEE"]
[null,null,null,"WANG TIANHUI","U1722943A","SM2","SM2 (12 MTHS)","Single","MAT"]
[null,null,null,"HE YUHAO","U1722945E","SM2","SM2 (12 MTHS)","Single","CSC"]
[null,null,null,"MA XIAO","U1722964K","SM2","SM2 (12 MTHS)","Single","CSC"]
[null,null,null,"ZHOU QIANYU","U1722972D","SM2","SM2 (12 MTHS)","Single","ME"]
[null,null,null,"YUAN XINYUE","U1740207G","SM2","SM2 (12 MTHS)","Single","MATH"]
[null,null,null,"FANG XIAOWEI","U1740276B","SM2","SM2 (12 MTHS)","Single","MATH"]
[null,null,null,"LI ZHAODONGHUI","U1740296J","SM2","SM2 (12 MTHS)","Single","MATH"]
[null,null,null,"YU LETIAN","U1740347G","MOE PreU Scholar (PRC)","No bridging","Single","PHY"]
[null,null,null,"HUA SHANSHAN","U1740586B","SM2","SM2 (12 MTHS)","Single","MATH"]
[null,null,null,"YANG RUHAN","U1740670L","MOE PreU Scholar (PRC)","No bridging","Single","BS"]
[null,null,null,"ZHANG YILIN","U1740676A","SM2","SM2 (12 MTHS)","Single","EESS"]
[null,null,null,"ZHANG MEILUN","U1740686K","SM2","SM2 (12 MTHS)","Single","EESS"]
[null,null,null,"TANG JINGXIANG","U1740824A","MOE PreU Scholar (PRC)","No bridging","Single","MATH"]
[null,null,null,"ZHANG XIJUE","U1820175B","MOE PreU Scholar (PRC)","No bridging","Single","CSC"]
[null,null,null,"FANG MEIHENG","U1820485B","MOE PreU Scholar (PRC)","No bridging","Single","EEE"]
[null,null,null,"HU MENGHUI","U1820497D","MOE PreU Scholar (PRC)","No bridging","Single","EEE"]
[null,null,null,"TAO YUAN","U1820659K","MOE PreU Scholar (PRC)","No bridging","Double (Type 1)","BCG"]
[null,null,null,"LIU YUHAO","U1820785D","MOE PreU Scholar (PRC)","No bridging","Single","EEE"]
[null,null,null,"SHI XUNCHENG","U1820979H","MOE PreU Scholar (PRC)","No bridging","Single","EEE"]
[null,null,null,"BALAMURUGAN DARSHINI","U1821574B","","No bridging","Double (Type 1)","BCG"]
[null,null,null,"ZHU ZHENWU","U1821714H","MOE PreU Scholar (PRC)","No bridging","Single","MAT"]
[null,null,null,"HU ZHUANGYU","U1821776L","MOE PreU Scholar (PRC)","No bridging","Single","DSAI"]
[null,null,null,"XIAO YANG","U1822003K","SM2","SM2 (12 MTHS)","Single","CSC"]
[null,null,null,"LI SIYI","U1822013H","SM2","SM2 (12 MTHS)","Single","AERO"]
[null,null,null,"XIE YONGGANG","U1822024H","SM2","SM2 (12 MTHS)","Single","EEE"]
[null,null,null,"HUANG YUNFAN","U1822026A","SM2","SM2 (12 MTHS)","Single","EEE"]
[null,null,null,"LI WENXUAN","U1822043B","SM2","SM2 (12 MTHS)","Single","MS"]
[null,null,null,"ZHANG HUAIYU","U1822063J","SM2","SM2 (12 MTHS)","Single","AERO"]
[null,null,null,"LEI MINGYUAN","U1822064L","SM2","SM2 (12 MTHS)","Single","EEE"]
[null,null,null,"SUN YUQI","U1822073G","SM2","SM2 (12 MTHS)","Single","EEE"]
[null,null,null,"YAO RUIBIN","U1822103G","SM2","SM2 (12 MTHS)","Single","EEE"]
[null,null,null,"WANG ZHAOXU","U1822104J","SM2","SM2 (12 MTHS)","Single","EEE"]
[null,null,null,"LI JIATONG","U1822115J","SM2","SM2 (12 MTHS)","Single","EEE"]
[null,null,null,"LIN LIXIAN","U1822133A","SM2","SM2 (12 MTHS)","Single","IEM"]
[null,null,null,"WANG YUZHEN","U1822143K","SM2","SM2 (12 MTHS)","Single","IEM"]
[null,null,null,"LI YICHENG","U1822144A","SM2","SM2 (12 MTHS)","Single","EEE"]
[null,null,null,"JIN CHENGKAI","U1822145C","SM2","SM2 (12 MTHS)","Single","CSC"]
[null,null,null,"LIU CHUYAO","U1822173D","SM2","SM2 (12 MTHS)","Single","BIE"]
[null,null,null,"AGGARWAL KAVYA","U1822178C","Direct","No bridging","Single","EEE"]
[null,null,null,"CHEN LIANGYU","U1822182L","SM2","SM2 (12 MTHS)","Single","IEM"]
[null,null,null,"LI WENHAN","U1822184D","SM2","SM2 (12 MTHS)","Single","EEE"]
[null,null,null,"JIN ZIHANG","U1822185F","SM2","SM2 (12 MTHS)","Single","ME"]
[null,null,null,"ZHAI YICHEN","U1822193L","SM2","SM2 (12 MTHS)","Single","CEE"]
[null,null,null,"JIANG ZINING","U1822204F","SM2","SM2 (12 MTHS)",{"$f":"VLOOKUP(I$1:I$5281,$A$37:$B$212,2,FALSE)","v":"Single"},"EEE"]
[null,null,null,"CAI YUXIN","U1822214D","SM2","SM2 (12 MTHS)","Single","ME"]
[null,null,null,"WANG JINGTAN","U1822215F","SM2","SM2 (12 MTHS)","Single","CSC"]
[null,null,null,"ZOU YULIN","U1822253E","SM2","SM2 (12 MTHS)","Single","CE"]
[null,null,null,"JIANG XINDOU","U1822265G","SM2","SM2 (12 MTHS)","Single","CEE"]
[null,null,null,"YANG JUNYAN","U1822273A","SM2","SM2 (12 MTHS)","Single","EEE"]
[null,null,null,"HU WENQI","U1822282H","SM2","SM2 (12 MTHS)","Single","CSC"]
[null,null,null,"JU JIANING","U1822283K","SM2","SM2 (12 MTHS)","Single","ME"]
[null,null,null,"XIA CHENGUANG","U1822292F","SM2","SM2 (12 MTHS)","Single","CE"]
[null,null,null,"CHAI DONG","U1822293H","SM2","SM2 (12 MTHS)","Single","EEE"]
[null,null,null,"LIU QIUYU","U1822303A","SM2","SM2 (12 MTHS)","Single","EEE"]
[null,null,null,"HE XIAOYU","U1822305E","SM2","SM2 (12 MTHS)","Single","EEE"]
[null,null,null,"CHEN YUXUAN","U1822315C","SM2","SM2 (12 MTHS)","Single","EEE"]
[null,null,null,"CHEN HONGYU","U1822334H","SM2","SM2 (12 MTHS)","Single","EEE"]
[null,null,null,"NI ANQI","U1822335K","SM2","SM2 (12 MTHS)","Single","IEM"]
[null,null,null,"DUAN YITING","U1822363L","SM2","SM2 (12 MTHS)","Single","CSC"]
[null,null,null,"ZHANG XINYI","U1822373J","SM2","SM2 (12 MTHS)","Single","CSC"]
[null,null,null,"LIAO YUWEN","U1822382E","SM2","SM2 (12 MTHS)","Single","ME"]
[null,null,null,"WU JIAZE","U1822383G","SM2","SM2 (12 MTHS)","Single","EEE"]
[null,null,null,"LI JIAYI","U1822392C","SM2","SM2 (12 MTHS)","Single","MS"]
[null,null,null,"WEN JUNZHENG","U1822395J","SM2","SM2 (12 MTHS)","Single","MAT"]
[null,null,null,"SANG JIAJUN","U1822403J","SM2","SM2 (12 MTHS)","Single","EEE"]
[null,null,null,"WEI CHEN","U1822413G","SM2","SM2 (12 MTHS)","Single","EEE"]
[null,null,null,"YE QIANHAN","U1822414J","SM2","SM2 (12 MTHS)","Single","IEM"]
[null,null,null,"LIN SINING","U1822423E","SM2","SM2 (12 MTHS)","Single","IEM"]
[null,null,null,"LIU YANLI","U1822424G","SM2","SM2 (12 MTHS)","Single","CSC"]
[null,null,null,"HUANG ZIQI","U1822425J","SM2","SM2 (12 MTHS)","Single","IEM"]
[null,null,null,"YU SHUAIQI","U1822434E","SM2","SM2 (12 MTHS)","Single","EEE"]
[null,null,null,"MA BOHAO","U1822463H","SM2","SM2 (12 MTHS)","Single","MS"]
[null,null,null,"WANG BOXIANG","U1822473F","SM2","SM2 (12 MTHS)","Single","EEE"]
[null,null,null,"SUN SHUJIAN","U1822482B","SM2","SM2 (12 MTHS)","Single","ME"]
[null,null,null,"ZHOU CHENHANG","U1822492L","SM2","SM2 (12 MTHS)","Single","EEE"]
[null,null,null,"XING AOYANG","U1822493B","SM2","SM2 (12 MTHS)","Single","EEE"]
[null,null,null,"MAO JUNKE","U1822503F","SM2","SM2 (12 MTHS)","Single","EEE"]
[null,null,null,"ZHENG QIAO","U1822513D","SM2","SM2 (12 MTHS)","Single","BIE"]
[null,null,null,"DONG WENYU","U1822524D","SM2","SM2 (12 MTHS)","Single","EEE"]
[null,null,null,"BHATIA RITIK","U1822529C","Direct","No bridging","Single","CSC"]
[null,null,null,"PAN YUE","U1822534B","SM2","SM2 (12 MTHS)","Single","EEE"]
[null,null,null,"WANG ZHAOHAN","U1822545B","SM2","SM2 (12 MTHS)","Single","EEE"]
[null,null,null,"WU SIBING","U1822553G","SM2","SM2 (12 MTHS)","Single","CSC"]
[null,null,null,"NIU ZEFENG","U1822563E","SM2","SM2 (12 MTHS)","Single","EEE"]
[null,null,null,"RAO YUCHEN","U1822573C","SM2","SM2 (12 MTHS)","Single","IEM"]
[null,null,null,"SHEN YUEJUN","U1822575G","SM2","SM2 (12 MTHS)","Single","MAT"]
[null,null,null,"XIAO YUXUAN","U1822582K","SM2","SM2 (12 MTHS)","Single","EEE"]
[null,null,null,"LIN YUXIN","U1822583A","SM2","SM2 (12 MTHS)","Single","EEE"]
[null,null,null,"WANG BOYAN","U1822592H","SM2","SM2 (12 MTHS)","Single","MAT"]
[null,null,null,"CHENG GUANDI","U1822593K","SM2","SM2 (12 MTHS)","Single","EEE"]
[null,null,null,"DONG YUNXING","U1822594A","SM2","SM2 (12 MTHS)","Single","CSC"]
[null,null,null,"PAN ZHIJIN","U1822595C","SM2","SM2 (12 MTHS)","Single","EEE"]
[null,null,null,"YAO YIFAN","U1822604E","SM2","SM2 (12 MTHS)","Single","IEM"]
[null,null,null,"LI HUANYE","U1822614C","SM2","SM2 (12 MTHS)","Single","EEE"]
[null,null,null,"ZHOU TONGFANG","U1822624A","SM2","SM2 (12 MTHS)","Single","EEE"]
[null,null,null,"GAN XIN","U1822635A","SM2","SM2 (12 MTHS)","Single","CSC"]
[null,null,null,"MA YUCHEN","U1822644H","SM2","SM2 (12 MTHS)","Single","EEE"]
[null,null,null,"XIA ZHIYANG","U1822655H","SM2","SM2 (12 MTHS)","Single","MS"]
[null,null,null,"SONG YUTONG","U1822663B","SM2","SM2 (12 MTHS)","Single","IEM"]
[null,null,null,"HOU BOYU","U1822673L","SM2","SM2 (12 MTHS)","Single","EEE"]
[null,null,null,"WANG ZIYAN","U1822682G","SM2","SM2 (12 MTHS)","Single","CSC"]
[null,null,null,"JIANG YUECHEN","U1822683J","SM2","SM2 (12 MTHS)","Single","EEE"]
[null,null,null,"PAN YONGQI","U1822692E","SM2","SM2 (12 MTHS)","Single","EEE"]
[null,null,null,"ZONG CHUQIAO","U1822693G","SM2","SM2 (12 MTHS)","Single","EEE"]
[null,null,null,"NAGAR AISHIK","U1822699H","Direct","No bridging","Single","EEE"]
[null,null,null,"DOU MAOKANG","U1822704B","SM2","SM2 (12 MTHS)","Single","CSC"]
[null,null,null,"XIONG JINGXI","U1822724J","SM2","SM2 (12 MTHS)","Single","EEE"]
[null,null,null,"XUE CHUANXU","U1822733E","SM2","SM2 (12 MTHS)",{"$f":"VLOOKUP(I$1:I$5281,$A$37:$B$212,2,FALSE)","v":"Single"},"CSC"]
[null,null,null,"WANG HONGJUN","U1822763K","SM2","SM2 (12 MTHS)","Single","IEM"]
[null,null,null,"ZHANG YUTONG","U1822772F","SM2","SM2 (12 MTHS)","Single","EEE"]
[null,null,null,"SU DUOYAO","U1822773H","SM2","SM2 (12 MTHS)","Single","CEE"]
[null,null,null,"WANG JINYUE","U1822774K","SM2","SM2 (12 MTHS)","Single","MS"]
[null,null,null,"MAO JIANGTIAN","U1822783F","SM2","SM2 (12 MTHS)","Single","EEE"]
[null,null,null,"LIN YANWEN","U1822792B","SM2","SM2 (12 MTHS)","Single","EEE"]
[null,null,null,"XU XIANGYU","U1822803H","SM2","SM2 (12 MTHS)","Single","CBE"]
[null,null,null,"DU ZHANKE","U1822804K","SM2","SM2 (12 MTHS)","Single","IEM"]
[null,null,null,"CHEN XIAOXIN","U1822853J","SM2","SM2 (12 MTHS)","Single","EEE"]
[null,null,null,"LIU XINYI","U1822863G","SM2","SM2 (12 MTHS)","Single","BIE"]
[null,null,null,"LU XINYANG","U1822873E","SM2","SM2 (12 MTHS)","Single","EEE"]
[null,null,null,"JIN ZIYAN","U1822874G","SM2","SM2 (12 MTHS)","Single","EEE"]
[null,null,null,"OUYANG YANJIA","U1822883C","SM2","SM2 (12 MTHS)","Single","EEE"]
[null,null,null,"HE YUFAN","U1822893A","SM2","SM2 (12 MTHS)","Single","AERO"]
[null,null,null,"LI HANG","U1822904G","SM2","SM2 (12 MTHS)","Single","EEE"]
[null,null,null,"WANG HAOYU","U1822924C","SM2","SM2 (12 MTHS)","Single","EEE"]
[null,null,null,"WANG YINGFENG","U1822945A","SM2","SM2 (12 MTHS)","Single","EEE"]
[null,null,null,"SINGH ARNAV","U1822969E",null,"No bridging","Single","EEE"]
[null,null,null,"WEI HAORAN","U1822972L","SM2","SM2 (12 MTHS)","Single","EEE"]
[null,null,null,"LI JIANHUI","U1822982J","SM2","SM2 (12 MTHS)","Single","EEE"]
[null,null,null,"QUAN GUANHENG","U1822983L","SM2","SM2 (12 MTHS)","Single","CEE"]
[null,null,null,"GONG HAI","U1822984B","MOE PreU Scholar (PRC)","No bridging","Double (Type 1)","BCG"]
[null,null,null,"MITTAL ISHAN","U1823050H","Direct","No bridging","Single","EEE"]
[null,null,null,"POTHUNURI LAYA","U1823420B","","No bridging","Single","ME"]
[null,null,null,"JOSYULA PRAHARSHITHA","U1823800E","Direct","No bridging","Single","EEE"]
[null,null,null,"KHARBANDA PRANSHU","U1823930G","Direct","No bridging","Single","ME"]
[null,null,null,"WU YUANQI","U1840007J","SM2","SM2 (12 MTHS)","Single","MATH"]
[null,null,null,"ZHOU HANXIAO","U1840016E","SM2","SM2 (12 MTHS)","Single","MATH"]
[null,null,null,"JIANG LINGLING","U1840036A","SM2","SM2 (12 MTHS)","Single","MATH"]
[null,null,null,"ZHANG ZHIYI","U1840066F","SM2","SM2 (12 MTHS)","Single","BS"]
[null,null,null,"ZHANG SHIZHUO","U1840116B","SM2","SM2 (12 MTHS)","Single","MATH"]
[null,null,null,"YUAN XINYUE","U1840146G","SM2","SM2 (12 MTHS)","Single","MATH"]
[null,null,null,"GUAN ZIHANG","U1840266L","SM2","SM2 (12 MTHS)","Single","MATH"]
[null,null,null,"WANG ZIHONG","U1840546F","SM2","SM2 (12 MTHS)","Single","MATH"]
[null,null,null,"SHENG SHUNAN","U1840636E","SM2","SM2 (12 MTHS)","Single","MATH"]
[null,null,null,"ZHANG YUHAN","U1840676H","SM2","SM2 (12 MTHS)","Single","CHEM"]
[null,null,null,"DUAN ZHAOMING","U1840716F","SM2","SM2 (12 MTHS)","Single","MATH"]
[null,null,null,"ZHOU ZIQI","U1840916L","SM2","SM2 (12 MTHS)","Single","MATH"]
[null,null,null,"HE WENYANG","U1840936G","SM2","SM2 (12 MTHS)","Single","MATH"]
[null,null,null,"CUI CHENLING","U1920157F","MOE PreU Scholar (PRC)","No bridging","Single","DSAI"]
[null,null,null,"ZHANG ZHUYAN","U1920187L","SM2","SM2 (12 MTHS)","Single","DSAI"]
[null,null,null,"WANG JIWEI","U1920559J","SM2","SM2 (12 MTHS)","Single","EEE"]
[null,null,null,"LI HAOCHENG","U1921700J","MOE PreU Scholar (PRC)","No bridging","Single","DSAI"]
[null,null,null,"SUI LULU","U1921987A","MOE PreU Scholar (PRC)","No bridging","Double (Type 1)","BCG"]
[null,null,null,"GUO XINYING","U1922079D","SM2","SM2 (12 MTHS)","Single","IEM"]
[null,null,null,"LI ZHUOXIN","U1922089B","SM2","SM2 (12 MTHS)","Single","EEE"]
[null,null,null,"HUANG YUPENG","U1922099L","SM2","SM2 (12 MTHS)","Single","CE"]
[null,null,null,"ZHENG QICHUN","U1922169C","SM2","SM2 (12 MTHS)","Single","EEE"]
[null,null,null,"ZHAO LAN","U1922189K","SM2","SM2 (12 MTHS)","Single","EEE"]
[null,null,null,"LIU JIKUN","U1922199H","SM2","SM2 (12 MTHS)","Single","EEE"]
[null,null,null,"ZHUANG YIHAO","U1922269L","SM2","SM2 (12 MTHS)","Single","EEE"]
[null,null,null,"XUE FUGUO","U1922289G","SM2","SM2 (12 MTHS)","Single","IEM"]
[null,null,null,"LU JINGJUN","U1922299E","SM2","SM2 (12 MTHS)","Single","EEE"]
[null,null,null,"QIN HUAIYUAN","U1922369H","SM2","SM2 (12 MTHS)","Single","EEE"]
[null,null,null,"GENG RUNQIU","U1922379F","SM2","SM2 (12 MTHS)","Single","EEE"]
[null,null,null,"YU XINYANG","U1922389D","SM2","SM2 (12 MTHS)","Single","CSC"]
[null,null,null,"WANG HONGFEI","U1922399B","SM2","SM2 (12 MTHS)","Single","EEE"]
[null,null,null,"SONG YU","U1922469E","SM2","SM2 (12 MTHS)","Single","CSC"]
[null,null,null,"YANG FENGRUI","U1922479C","SM2","SM2 (12 MTHS)","Single","BIE"]
[null,null,null,"LEI AO","U1922489A","SM2","SM2 (12 MTHS)","Single","CEE"]
[null,null,null,"WEI KAITAO","U1922499K","SM2","SM2 (12 MTHS)","Single","CSC"]
[null,null,null,"MA RUNDI","U1922569B","SM2","SM2 (12 MTHS)","Single","IEM"]
[null,null,null,"GUO CHENJUN","U1922579L","SM2","SM2 (12 MTHS)","Single","IEM"]
[null,null,null,"YU SHUJIN","U1922669K","SM2","SM2 (12 MTHS)",{"$f":"VLOOKUP(I$1:I$5281,$A$37:$B$212,2,FALSE)","v":"Single"},"MAT"]
[null,null,null,"LIAO YIYU","U1922679H","SM2","SM2 (12 MTHS)","Single","MAT"]
[null,null,null,"LI RUI","U1922689F","SM2","SM2 (12 MTHS)","Single","CSC"]
[null,null,null,"LIU ZINAN","U1922699D","SM2","SM2 (12 MTHS)","Single","EEE"]
[null,null,null,"CHI KAILUN","U1922789C","SM2","SM2 (12 MTHS)","Single","ME"]
[null,null,null,"TANG YUTING","U1922869D","SM2","SM2 (12 MTHS)","Single","CSC"]
[null,null,null,"LI PINGRUI","U1922879B","SM2","SM2 (12 MTHS)","Single","CSC"]
[null,null,null,"CHEN DONGJIE","U1922889L","SM2","SM2 (12 MTHS)","Single","CBE"]
[null,null,null,"DAI YUHE","U1922899J","SM2","SM2 (12 MTHS)","Single","EEE"]
[null,null,null,"JIN HUIWEN","U1922969A","SM2","SM2 (12 MTHS)","Single","EEE"]
[null,null,null,"YU HEMING","U1922979K","SM2","SM2 (12 MTHS)","Single","MS"]
[null,null,null,"WANG JIHAN","U1923000C","SM2","SM2 (12 MTHS)","Single","EEE"]
[null,null,null,"LI JIAN","U1923010A","SM2","SM2 (12 MTHS)","Single","ME"]
[null,null,null,"YU YUE","U1923020K","SM2","SM2 (12 MTHS)","Single","IEM"]
[null,null,null,"LUO JINGSONG","U1923030H","SM2","SM2 (12 MTHS)","Single","MAT"]
[null,null,null,"ZHANG ZILI","U1923040F","SM2","SM2 (12 MTHS)","Single","ME"]
[null,null,null,"ZHOU HAORAN","U1923050D","SM2","SM2 (12 MTHS)","Single","CE"]
[null,null,null,"FENG QINGYU","U1923060B","SM2","SM2 (12 MTHS)","Single","CSC"]
[null,null,null,"WEN ZHENGYU","U1923070L","SM2","SM2 (12 MTHS)","Single","CSC"]
[null,null,null,"ZHONG ZHENLIN","U1923080J","SM2","SM2 (12 MTHS)","Single","EEE"]
[null,null,null,"TANG YIYAO","U1923090G","SM2","SM2 (12 MTHS)","Single","EEE"]
[null,null,null,"WU TONG","U1923100L","SM2","SM2 (12 MTHS)","Single","ME"]
[null,null,null,"YIN NING","U1923120G","SM2","SM2 (12 MTHS)","Single","CSC"]
[null,null,null,"ROY ANURAG","U1923122L","","No bridging","Single","ME"]
[null,null,null,"SHU NING","U1923130E","SM2","SM2 (12 MTHS)","Single","MS"]
[null,null,null,"YE ZIYUAN","U1923140C","SM2","SM2 (12 MTHS)","Single","CSC"]
[null,null,null,"DING SHAOBO","U1923150A","SM2","SM2 (12 MTHS)","Single","EEE"]
[null,null,null,"ANIL ANKITHA","U1923151C","","No bridging","Single","CSC"]
[null,null,null,"YE SONGYI","U1923160K","SM2","SM2 (12 MTHS)","Single","EEE"]
[null,null,null,"LIAO ZHONGTIAN","U1923180F","SM2","SM2 (12 MTHS)","Single","EEE"]
[null,null,null,"WANG XIAONI","U1923200H","SM2","SM2 (12 MTHS)","Single","ME"]
[null,null,null,"GONG ZEYU","U1923220D","SM2","SM2 (12 MTHS)","Single","EEE"]
[null,null,null,"YIN HANG","U1923250J","SM2","SM2 (12 MTHS)","Single","AERO"]
[null,null,null,"ZHANG HENGRUI","U1923260G","SM2","SM2 (12 MTHS)","Single","EEE"]
[null,null,null,"LI YIBAI","U1923270E","SM2","SM2 (12 MTHS)","Single","CSC"]
[null,null,null,"ZHU ZIYING","U1923280C","SM2","SM2 (12 MTHS)","Single","IEM"]
[null,null,null,"GE ZHUOYAN","U1923300E","SM2","SM2 (12 MTHS)","Single","CSC"]
[null,null,null,"KESARIMANGALAM SRINIVASAN ABHINAYA","U1923302J","","No bridging","Single","CE"]
[null,null,null,"ARUTSELVAN PRANAV GANESH","U1923312G","","No bridging","Single","MAT"]
[null,null,null,"JIAO SHAOBO","U1923320A","SM2","SM2 (12 MTHS)","Single","EEE"]
[null,null,null,"CHEN YI","U1923330K","SM2","SM2 (12 MTHS)","Single","ME"]
[null,null,null,"LIU MEICHI","U1923350F","SM2","SM2 (12 MTHS)","Single","EEE"]
[null,null,null,"ZHANG HAN","U1923360D","SM2","SM2 (12 MTHS)","Single","EEE"]
[null,null,null,"XU QIANYI","U1923361F","SM2","SM2 (12 MTHS)","Single","EEE"]
[null,null,null,"ZENG HUA","U1923370B","SM2","SM2 (12 MTHS)","Single","EEE"]
[null,null,null,"CHENG NUO","U1923380L","SM2","SM2 (12 MTHS)","Single","EEE"]
[null,null,null,"TAN TIAN","U1923390J","SM2","SM2 (12 MTHS)","Single","EEE"]
[null,null,null,"LI YOU","U1923400B","SM2","SM2 (12 MTHS)","Single","AERO"]
[null,null,null,"SINGH ANANYA","U1923401D","","No bridging","Single","DSAI"]
[null,null,null,"WANG ANNAN","U1923430G","SM2","SM2 (12 MTHS)","Single","CSC"]
[null,null,null,"ZHU TIANYI","U1923440E","SM2","SM2 (12 MTHS)","Single","EEE"]
[null,null,null,"CEN YU","U1923450C","SM2","SM2 (12 MTHS)","Single","EEE"]
[null,null,null,"ZHU YAQI","U1923470K","SM2","SM2 (12 MTHS)","Single","ME"]
[null,null,null,"HUANG RUNTAO","U1923490F","SM2","SM2 (12 MTHS)","Single","CSC"]
[null,null,null,"ZHOU ZEYU","U1923500K","SM2","SM2 (12 MTHS)","Single","CSC"]
[null,null,null,"ACHARYA ATUL","U1923502C","SM2","SM2 (12 MTHS)","Single","CSC"]
[null,null,null,"TAN JICHEN","U1923510H","SM2","SM2 (12 MTHS)","Single","IEM"]
[null,null,null,"KONG YIYANG","U1923520F","SM2","SM2 (12 MTHS)","Single","EEE"]
[null,null,null,"LIU ZHIXUAN","U1923530D","SM2","SM2 (12 MTHS)","Single","CSC"]
[null,null,null,"QUAN YI","U1923550L","SM2","SM2 (12 MTHS)","Single","ME"]
[null,null,null,"LIU FAYANG","U1923560J","SM2","SM2 (12 MTHS)","Single","EEE"]
[null,null,null,"DOU YUXIAO","U1923570G","SM2","SM2 (12 MTHS)","Single","EEE"]
[null,null,null,"SU HANG","U1923590C","SM2","SM2 (12 MTHS)","Single","EEE"]
[null,null,null,"XU YINGCHU","U1923600G","SM2","SM2 (12 MTHS)","Single","EEE"]
[null,null,null,"ZHAO YINJIE","U1923610E","SM2","SM2 (12 MTHS)",{"$f":"VLOOKUP(I$1:I$5281,$A$37:$B$212,2,FALSE)","v":"Single"},"EEE"]
[null,null,null,"WANG BINLI","U1923620C","SM2","SM2 (12 MTHS)","Single","CSC"]
[null,null,null,"CHEN XINYAN","U1923630A","SM2","SM2 (12 MTHS)","Single","EEE"]
[null,null,null,"XIE HANG","U1923640K","SM2","SM2 (12 MTHS)","Single","ME"]
[null,null,null,"HUANG SHIQI","U1923650H","SM2","SM2 (12 MTHS)","Single","EEE"]
[null,null,null,"MENG XUYI","U1923660F","SM2","SM2 (12 MTHS)","Single","CSC"]
[null,null,null,"FU SHIHAO","U1923670D","SM2","SM2 (12 MTHS)","Single","EEE"]
[null,null,null,"MA SITENG","U1923700D","SM2","SM2 (12 MTHS)","Single","EEE"]
[null,null,null,"ZHAO PEIZHU","U1923710B","SM2","SM2 (12 MTHS)","Single","CSC"]
[null,null,null,"LI JIAYI","U1923730J","SM2","SM2 (12 MTHS)","Single","CSC"]
[null,null,null,"WANG XIAOXUE","U1923740G","SM2","SM2 (12 MTHS)","Single","EEE"]
[null,null,null,"WANG YING","U1923750E","SM2","SM2 (12 MTHS)","Single","CSC"]
[null,null,null,"LI JIANGYUN","U1923760C","SM2","SM2 (12 MTHS)","Single","EEE"]
[null,null,null,"DENG ZIYANG","U1923770A","SM2","SM2 (12 MTHS)","Single","CE"]
[null,null,null,"LI QIXIANG","U1923810K","SM2","SM2 (12 MTHS)","Single","MAT"]
[null,null,null,"WANG QIAOCHU","U1923820H","SM2","SM2 (12 MTHS)","Single","CSC"]
[null,null,null,"LIU QINGYI","U1923840D","SM2","SM2 (12 MTHS)","Single","MAT"]
[null,null,null,"GAO MANRONG","U1923850B","SM2","SM2 (12 MTHS)","Single","EEE"]
[null,null,null,"DING MEIWEN","U1923860L","SM2","SM2 (12 MTHS)","Single","EEE"]
[null,null,null,"WANG YIRAN","U1923870J","SM2","SM2 (12 MTHS)","Single","MATH"]
[null,null,null,"ASURI SIMHAKUTTY KAMAKSHI","U1923890E","","No bridging","Single","CE"]
[null,null,null,"VEDULA KARTIKEYA","U1923891G","","No bridging","Single","CE"]
[null,null,null,"WANG DI","U1923900J","SM2","SM2 (12 MTHS)","Single","EEE"]
[null,null,null,"LIU SITONG","U1923910G","SM2","SM2 (12 MTHS)","Single","AERO"]
[null,null,null,"XIE MENGDI","U1923920E","SM2","SM2 (12 MTHS)","Single","EEE"]
[null,null,null,"ZUO HAOTIAN","U1923930C","SM2","SM2 (12 MTHS)","Single","EEE"]
[null,null,null,"LI YUJIA","U1923940A","SM2","SM2 (12 MTHS)","Single","MAT"]
[null,null,null,"DAI YINGCHAO","U1923950K","SM2","SM2 (12 MTHS)","Single","IEM"]
[null,null,null,"LIU RUIQIAN","U1923970F","SM2","SM2 (12 MTHS)","Single","IEM"]
[null,null,null,"GARG ASTHA","U1923971H","","No bridging","Single","CSC"]
[null,null,null,"SONG RUIQI","U1940148G","SM2","SM2 (12 MTHS)","Single","MATH"]
[null,null,null,"MA YUHAN","U1940438L","SM2","SM2 (12 MTHS)","Single","MATH"]
[null,null,null,"ZHANG TIANYU","U1940448J","SM2","SM2 (12 MTHS)","Single","MATH"]
[null,null,null,"ZHAO WENRUI","U1940538H","SM2","SM2 (12 MTHS)","Single","MATH"]
[null,null,null,"CHENG ZHENGXING","U1940738B","SM2","SM2 (12 MTHS)","Single","MATH"]
[null,null,null,"ZHANG NUOYA","U1940838K","SM2","SM2 (12 MTHS)","Single","PHY"]
[null,null,null,"HUANG JINGFANG","U2020128A","SM2","SM2 (12 MTHS)","Single","DSAI"]
[null,null,null,"CAO QINGTIAN","U2020646L","SM2","SM2 (12 MTHS)","Single","DSAI"]
[null,null,null,"FANG ROULI","U2020907A","SM2","SM2 (12 MTHS)","Single","EEE"]
[null,null,null,"ZHOU QIREN","U2021125J","SM2","SM2 (12 MTHS)","Double (Type 1)","BCG"]
[null,null,null,"DING MAN","U2022009E","SM2","SM2 (12 MTHS)","Single","IEM"]
[null,null,null,"XIE XINZHE","U2022019C","SM2","SM2 (12 MTHS)","Single","EEE"]
[null,null,null,"WANG QIANTENG","U2022039K","SM2","SM2 (12 MTHS)","Single","CSC"]
[null,null,null,"XUE YUSHAN","U2022049H","SM2","SM2 (12 MTHS)","Single","CSC"]
[null,null,null,"LIU CHANGSONG","U2022059F","SM2","SM2 (12 MTHS)","Single","CSC"]
[null,null,null,"ZHANG HAORAN","U2022069D","SM2","SM2 (12 MTHS)","Single","IEM"]
[null,null,null,"ZHOU YUXUAN","U2022079B","SM2","SM2 (12 MTHS)","Single","CSC"]
[null,null,null,"HU SIYUAN","U2022099J","SM2","SM2 (12 MTHS)","Single","CSC"]
[null,null,null,"ZHANG CHI","U2022109B","SM2","SM2 (12 MTHS)","Single","CSC"]
[null,null,null,"HAN ZHIZE","U2022119L","SM2","SM2 (12 MTHS)","Single","IEM"]
[null,null,null,"LIU SONGTING","U2022129J","SM2","SM2 (12 MTHS)","Single","EEE"]
[null,null,null,"SUN QIYANG","U2022139G","SM2","SM2 (12 MTHS)","Single","IEM"]
[null,null,null,"TIAN SHULIN","U2022149E","SM2","SM2 (12 MTHS)","Single","EEE"]
[null,null,null,"QI KEHU","U2022159C","SM2","SM2 (12 MTHS)","Single","CE"]
[null,null,null,"PENG XINYU","U2022169A","SM2","SM2 (12 MTHS)","Single","EEE"]
[null,null,null,"WANG HAOXUAN","U2022179K","SM2","SM2 (12 MTHS)","Single","CSC"]
[null,null,null,"JI HANYI","U2022188F","SM2","SM2 (12 MTHS)","Single","CSC"]
[null,null,null,"XIE YUXUAN","U2022189H","SM2","SM2 (12 MTHS)","Single","ME"]
[null,null,null,"JIANG JIAXI","U2022209K","SM2","SM2 (12 MTHS)","Single","CSC"]
[null,null,null,"ZHONG RUOYU","U2022229F","SM2","SM2 (12 MTHS)","Single","CSC"]
[null,null,null,"ZHENG ZHOUDONG","U2022239D","SM2","SM2 (12 MTHS)","Single","EEE"]
[null,null,null,"NAN WENTAI","U2022249B","SM2","SM2 (12 MTHS)","Single","CSC"]
[null,null,null,"DIAO SHENGJIA","U2022259L","SM2","SM2 (12 MTHS)","Single","EEE"]
[null,null,null,"LUO YIHANG","U2022279G","SM2","SM2 (12 MTHS)","Single","CSC"]
[null,null,null,"HE JIAYI","U2022289E","SM2","SM2 (12 MTHS)",{"$f":"VLOOKUP(I$1:I$5281,$A$37:$B$212,2,FALSE)","v":"Single"},"ME"]
[null,null,null,"WU JINGYAN","U2022319E","SM2","SM2 (12 MTHS)","Single","AERO"]
[null,null,null,"HAO MINGYU","U2022329C","SM2","SM2 (12 MTHS)","Single","EEE"]
[null,null,null,"ZHANG ERLI","U2022339A","SM2","SM2 (12 MTHS)","Single","CSC"]
[null,null,null,"LIN ZIJUN","U2022349K","SM2","SM2 (12 MTHS)","Single","EEE"]
[null,null,null,"FU GUANQIAO","U2022359H","SM2","SM2 (12 MTHS)","Single","CSC"]
[null,null,null,"WANG RUISI","U2022369F","SM2","SM2 (12 MTHS)","Single","CSC"]
[null,null,null,"ZHU BANGYUAN","U2022379D","SM2","SM2 (12 MTHS)","Single","EEE"]
[null,null,null,"CHEN QI","U2022399L","SM2","SM2 (12 MTHS)","Single","EEE"]
[null,null,null,"WAN YAXIN","U2022409D","SM2","SM2 (12 MTHS)","Single","CSC"]
[null,null,null,"WEN ZHILAN","U2022419B","SM2","SM2 (12 MTHS)","Single","EEE"]
[null,null,null,"WANG YAOXUAN","U2022429L","SM2","SM2 (12 MTHS)","Single","IEM"]
[null,null,null,"WANG JINGWEI","U2022439J","SM2","SM2 (12 MTHS)","Single","CSC"]
[null,null,null,"ZHANG HEYI","U2022459E","SM2","SM2 (12 MTHS)","Single","EEE"]
[null,null,null,"FAN ZIFU","U2022469C","SM2","SM2 (12 MTHS)","Single","ME"]
[null,null,null,"ZHANG MENG","U2022479A","SM2","SM2 (12 MTHS)","Single","EEE"]
[null,null,null,"ZENG XUNYI","U2022509A","SM2","SM2 (12 MTHS)","Single","CSC"]
[null,null,null,"ZHANG XUANYE","U2022519K","SM2","SM2 (12 MTHS)","Single","CE"]
[null,null,null,"ZHOU YIXUAN","U2022529H","SM2","SM2 (12 MTHS)","Single","CSC"]
[null,null,null,"SHI ZHENGYU","U2022539F","SM2","SM2 (12 MTHS)","Single","CSC"]
[null,null,null,"ZHANG WEI","U2022549D","SM2","SM2 (12 MTHS)","Single","IEM"]
[null,null,null,"SHEN BOYI","U2022559B","SM2","SM2 (12 MTHS)","Single","MAT"]
[null,null,null,"HUANG MENGHUI","U2022569L","SM2","SM2 (12 MTHS)","Single","EEE"]
[null,null,null,"HUANG ZEWU","U2022599E","SM2","SM2 (12 MTHS)","Single","EEE"]
[null,null,null,"MAO YIYUN","U2022609J","SM2","SM2 (12 MTHS)","Single","CSC"]
[null,null,null,"HOU BO","U2022619G","SM2","SM2 (12 MTHS)","Single","IEM"]
[null,null,null,"WANG YIYING","U2022629E","SM2","SM2 (12 MTHS)","Single","CSC"]
[null,null,null,"MA XINYI","U2022639C","SM2","SM2 (12 MTHS)","Single","CSC"]
[null,null,null,"WANG TIANYU","U2022659K","SM2","SM2 (12 MTHS)","Single","CSC"]
[null,null,null,"DU WEIFANG","U2022669H","SM2","SM2 (12 MTHS)","Single","ME"]
[null,null,null,"KE GUANGUAN","U2022678D","SM2","SM2 (12 MTHS)","Single","ME"]
[null,null,null,"YANG YIDA","U2022689D","SM2","SM2 (12 MTHS)","Single","CSC"]
[null,null,null,"LI XINYU","U2022709F","SM2","SM2 (12 MTHS)","Single","EEE"]
[null,null,null,"LU JIAJU","U2022719D","SM2","SM2 (12 MTHS)","Single","EEE"]
[null,null,null,"MA XIAOYU","U2022729B","SM2","SM2 (12 MTHS)","Single","EEE"]
[null,null,null,"PENG YANGLING","U2022739L","SM2","SM2 (12 MTHS)","Single","EEE"]
[null,null,null,"JIANG YUXIN","U2022749J","SM2","SM2 (12 MTHS)","Single","CSC"]
[null,null,null,"HU TIANRUN","U2022759G","SM2","SM2 (12 MTHS)","Single","CE"]
[null,null,null,"LUO RUIQI","U2022769E","SM2","SM2 (12 MTHS)","Single","EEE"]
[null,null,null,"LIU FANZHENG","U2022778A","SM2","SM2 (12 MTHS)","Single","BIE"]
[null,null,null,"HUANG ERDONG","U2022779C","SM2","SM2 (12 MTHS)","Single","EEE"]
[null,null,null,"ZHOU KAIYU","U2022789A","SM2","SM2 (12 MTHS)","Single","EEE"]
[null,null,null,"LIU ZIHAO","U2022799K","SM2","SM2 (12 MTHS)","Single","EEE"]
[null,null,null,"LI JIAYI","U2022809C","SM2","SM2 (12 MTHS)","Single","EEE"]
[null,null,null,"ZHANG SIQI","U2022819A","SM2","SM2 (12 MTHS)","Single","EEE"]
[null,null,null,"WANG CHUHAN","U2022829K","SM2","SM2 (12 MTHS)","Single","CSC"]
[null,null,null,"LIU FENGHAO","U2022839H","SM2","SM2 (12 MTHS)","Single","CSC"]
[null,null,null,"LI JINGYUAN","U2022849F","SM2","SM2 (12 MTHS)","Single","EEE"]
[null,null,null,"HOU ZHEYI","U2022859D","SM2","SM2 (12 MTHS)","Single","EEE"]
[null,null,null,"DONG LUOJIE","U2022869B","SM2","SM2 (12 MTHS)","Single","CE"]
[null,null,null,"GU CHENYANG","U2022878J","SM2","SM2 (12 MTHS)","Single","EEE"]
[null,null,null,"LI XINGJIAN","U2022889J","SM2","SM2 (12 MTHS)","Single","CSC"]
[null,null,null,"LING ZIJIE","U2022899G","SM2","SM2 (12 MTHS)","Single","EEE"]
[null,null,null,"ZHANG JINGYI","U2022909L","SM2","SM2 (12 MTHS)","Single","EEE"]
[null,null,null,"WANG SHENGYUAN","U2022919J","SM2","SM2 (12 MTHS)","Single","EEE"]
[null,null,null,"KE TANGXIN","U2022939E","SM2","SM2 (12 MTHS)","Single","EEE"]
[null,null,null,"YAN JINJIANG","U2022949C","SM2","SM2 (12 MTHS)","Single","EEE"]
[null,null,null,"MAO RUOYI","U2022959A","SM2","SM2 (12 MTHS)","Single","EEE"]
[null,null,null,"WANG YUCHENG","U2022969K","SM2","SM2 (12 MTHS)","Single","EEE"]
[null,null,null,"RUAN DONGLIN","U2022979H","SM2","SM2 (12 MTHS)","Single","CSC"]
[null,null,null,"ZHANG LIXING","U2022989F","SM2","SM2 (12 MTHS)","Single","MAT"]
[null,null,null,"ZHANG MENGAO","U2023060L","SM2","SM2 (12 MTHS)","Single","CSC"]
[null,null,null,"CHEN YUTONG","U2023140A","SM2","SM2 (12 MTHS)","Single","EEE"]
[null,null,null,"LIU XINRAN","U2023160H","SM2","SM2 (12 MTHS)","Single","CSC"]
[null,null,null,"HE ZIYU","U2023220B","SM2","SM2 (12 MTHS)",{"$f":"VLOOKUP(I$1:I$5281,$A$37:$B$212,2,FALSE)","v":"Single"},"EEE"]
[null,null,null,"ZHANG ZIHAN","U2023230L","SM2","SM2 (12 MTHS)","Single","ME"]
[null,null,null,"TIYYAGURA ROCHANA","U2023234H","SM2","SM2 (12 MTHS)","Single","CSC"]
[null,null,null,"YAO HENGJI","U2023240J","SM2","SM2 (12 MTHS)","Single","EEE"]
[null,null,null,"LIU XINYAO","U2023250G","SM2","SM2 (12 MTHS)","Single","EEE"]
[null,null,null,"HU ZIHAO","U2023350D","SM2","SM2 (12 MTHS)","Single","EEE"]
[null,null,null,"YU XIN","U2023360B","SM2","SM2 (12 MTHS)","Single","EEE"]
[null,null,null,"LIANG YINGYUE","U2023402D","SM2","SM2 (12 MTHS)","Single","CBE"]
[null,null,null,"JIANG ZEYU","U2023410J","SM2","SM2 (12 MTHS)","Single","EEE"]
[null,null,null,"ZHU BUYUAN","U2023430E","SM2","SM2 (12 MTHS)","Single","EEE"]
[null,null,null,"YU TIANZE","U2023450A","SM2","SM2 (12 MTHS)","Single","EEE"]
[null,null,null,"ZHANG ZONGXIAN","U2023520D","SM2","SM2 (12 MTHS)","Single","EEE"]
[null,null,null,"LI XINYI","U2023530B","SM2","SM2 (12 MTHS)","Single","CSC"]
[null,null,null,"PENG WENXUAN","U2023560G","SM2","SM2 (12 MTHS)","Single","CSC"]
[null,null,null,"LI YONGJIE","U2023600E","SM2","SM2 (12 MTHS)","Single","EEE"]
[null,null,null,"CHEN YUMU","U2023760A","SM2","SM2 (12 MTHS)","Single","EEE"]
[null,null,null,"PAN YUHANG","U2023830D","SM2","SM2 (12 MTHS)","Single","EEE"]
[null,null,null,"LUO QIAN","U2023870G","SM2","SM2 (12 MTHS)","Single","EEE"]
[null,null,null,"HU KAIRUI","U2023900G","SM2","SM2 (12 MTHS)","Single","CSC"]
[null,null,null,"WU ZICHENG","U2023910E","SM2","SM2 (12 MTHS)","Single","AERO"]
[null,null,null,"YU JIAYI","U2023920C","SM2","SM2 (12 MTHS)","Single","EEE"]
[null,null,null,"MA CHUNYOU","U2023930A","SM2","SM2 (12 MTHS)","Single","CSC"]
[null,null,null,"LIU SHIFEI","U2023950H","SM2","SM2 (12 MTHS)","Single","EEE"]
[null,null,null,"SANSKRITI VERMA","U2023954E","SM2","SM2 (12 MTHS)","Single","CSC"]
[null,null,null,"AMITA RAVI","U2023964C","SM2","SM2 (12 MTHS)","Single","CSC"]
[null,null,null,"LIU YUFEI","U2040096E","SM2","SM2 (12 MTHS)","Single","MATH"]
[null,null,null,"WU YANJUN","U2040153D","SM2","SM2 (12 MTHS)","Single","BS"]
[null,null,null,"WANG YUJING","U2040172J","SM2","SM2 (12 MTHS)","Single","MACS"]
[null,null,null,"SONG YULI","U2040196B","SM2","SM2 (12 MTHS)","Single","MATH"]
[null,null,null,"CHEN ZEYI","U2040386J","SM2","SM2 (12 MTHS)","Single","MATH"]
[null,null,null,"JIN SHINAN","U2040886E","SM2","SM2 (12 MTHS)","Single","MATH"]
[null,null,null,null,null,null,null,{"$error":"#N/A"}]

{"sheet":"ResponseForm","index":2,"n_rows":1,"n_cols":5,"rows_kept":1,"cut":false,"hidden":true,"merged":[]}
["Matric No.","Matric Year","Scheme","Deg Type","BG Amt"]

{"sheet":"LD Table","index":3,"n_rows":200,"n_cols":4,"rows_kept":200,"cut":false,"hidden":true,"merged":[]}
["Matric Year","Scheme","Degree Type","BG Amt"]
[2001,"SM2","Single",125000]
[2001,"SM2-AP/SM3","Single",105000]
[2001,"No bridging","Single",85000]
[2002,"SM2","Single",125000]
[2002,"SM2-AP/SM3","Single",105000]
[2002,"No bridging","Single",85000]
[2003,"SM2","Single",125000]
[2003,"SM2-AP/SM3","Single",116000]
[2003,"No bridging","Single",85000]
[2004,"SM2","Single",125000]
[2004,"SM2-AP/SM3","Single",116000]
[2004,"No bridging","Single",85000]
[2005,"SM2","Single",125000]
[2005,"SM2-AP/SM3","Single",116000]
[2005,"No bridging","Single",85000]
[2006,"SM2","Single",125000]
[2006,"SM2-AP/SM3","Single",130000]
[2006,"No bridging","Single",85000]
[2006,"SM2","Double ",125000]
[2006,"SM2-AP/SM3","Double",130000]
[2007,"SM2","Single",122000]
[2007,"SM2-AP/SM3","Single",97000]
[2007,"No bridging","Single",159000]
[2007,"SM2","Double ",159000]
[2007,"SM2-AP/SM3","Double",129000]
[2007,"No bridging","Double ",112000]
[2008,"SM2","Single",137000]
[2008,"SM2-AP/SM3","Single",111000]
[2008,"No bridging","Single",100000]
[2008,"SM2","Double ",173000]
[2008,"SM2-AP/SM3","Double ",150000]
[2008,"No bridging","Double ",131000]
[2009,"SM2","Single",138000]
[2009,"SM2-AP/SM3","Single",112000]
[2009,"No bridging","Single",102000]
[2009,"SM2","Double ",181000]
[2009,"SM2-AP/SM3","Double",156000]
[2009,"No bridging","Double",137000]
[2010,"SM2","Single",147000]
[2010,"SM2-AP/SM3","Single",118000]
[2010,"No bridging","Single",108000]
[2010,"SM2","Double (Type 1)",152000]
[2010,"SM2-AP/SM3","Double (Type 1)",123000]
[2010,"No bridging","Double (Type 1)",112000]
[2010,"SM2","Double (Type 2)",191000]
[2010,"SM2-AP/SM3","Double (Type 2)",159000]
[2010,"No bridging","Double (Type 2)",147000]
[2011,"SM2","Single",157000]
[2011,"SM2-AP/SM3","Single",135000]
[2011,"No bridging","Single",114000]
[2011,"SM2","Double (Type 1)",175000]
[2011,"SM2-AP/SM3","Double (Type 1)",154000]
[2011,"No bridging","Double (Type 1)",132000]
[2011,"SM2","Double (Type 2)",205000]
[2011,"SM2-AP/SM3","Double (Type 2)",182000]
[2011,"No bridging","Double (Type 2)",159000]
[2012,"SM2 (20 MTHS)","Single",172000]
[2012,"SM2 (12 MTHS)","Single",162000]
[2012,"SM3","Single",144000]
[2012,"No bridging","Single",112700]
[2012,"SM2 (20 MTHS)","Double (Type 1)",181000]
[2012,"SM2 (12 MTHS)","Double (Type 1)",171000]
[2012,"SM3","Double (Type 1)",153000]
[2012,"No bridging","Double (Type 1)",136000]
[2012,"SM2 (20 MTHS)","Double (Type 2)",216000]
[2012,"SM2 (12 MTHS)","Double (Type 2)",205000]
[2012,"SM3","Double (Type 2)",185000]
[2012,"No bridging","Double (Type 2)",166000]
[2013,"SM2 (20 MTHS)","Single",163000]
[2013,"SM2 (12 MTHS)","Single",161000]
[2013,"No bridging","Single",126000]
[2013,"SM2 (20 MTHS)","Double (Type 1)",173000]
[2013,"SM2 (12 MTHS)","Double (Type 1)",171000]
[2013,"No bridging","Double (Type 1)",136000]
[2013,"No bridging","Double (Type 2)",166000]
[2014,"SM2 (12 MTHS)","Single",159000]
[2014,"No bridging","Single",207000]
[2014,"SM2 (12 MTHS)","Double (Type 1)",169000]
[2014,"No bridging","Double (Type 2)",169000]
[2015,"SM2 (12 MTHS)","Single",158000]
[2015,"No bridging","Single",133000]
[2015,"No bridging","Double (Type 1)",144000]
[2016,"SM2 (12 MTHS)","Single",165000]
[2016,"No bridging","Single",139000]
[2016,"No bridging","Double (Type 1)",151000]
[2017,"SM2 (12 MTHS)","Single",168000]
[2017,"No bridging","Single",148000]
[2017,"No bridging","Double (Type 1)",161000]
[2018,"SM2 (12 MTHS)","Single",168000]
[2018,"No bridging","Single",142000]
[2018,"No bridging","Double (Type 1)",155000]
[2019,"SM2 (12 MTHS)","Single",171000]
[2019,"No bridging","Single",142000]
[2019,"No bridging","Double (Type 1)",120000]
[2020,"SM2 (12 MTHS)","Single",171000]
[2020,"No bridging","Single",144000]
[2020,"No bridging","Double (Type 1)",157000]
[]
[]
[]
[]
["Matric Year","Scheme","Degree Type","LD Amt"]
[2001,"SM2","Single",125000]
[2001,"SM2-AP/SM3","Single",105000]
[2001,"No bridging","Single",85000]
[2002,"SM2","Single",125000]
[2002,"SM2-AP/SM3","Single",105000]
[2002,"No bridging","Single",85000]
[2003,"SM2","Single",125000]
[2003,"SM2-AP/SM3","Single",116000]
[2003,"No bridging","Single",85000]
[2004,"SM2","Single",125000]
[2004,"SM2-AP/SM3","Single",116000]
[2004,"No bridging","Single",85000]
[2005,"SM2","Single",125000]
[2005,"SM2-AP/SM3","Single",116000]
[2005,"No bridging","Single",85000]
[2006,"SM2","Single",125000]
[2006,"SM2-AP/SM3","Single",130000]
[2006,"No bridging","Single",85000]
[2006,"SM2","Double ",125000]
[2006,"SM2-AP/SM3","Double",130000]
[2007,"SM2","Single",122000]
[2007,"SM2-AP/SM3","Single",122000]
[2007,"No bridging","Single",85000]
[2007,"SM2","Double ",159000]
[2007,"SM2-AP/SM3","Double",159000]
[2007,"No bridging","Double",112000]
[2008,"SM2","Single",137000]
[2008,"SM2-AP/SM3","Single",137000]
[2008,"No bridging","Single",100000]
[2008,"SM2","Double ",173000]
[2008,"SM2-AP/SM3","Double",173000]
[2008,"No bridging","Double",131000]
[2009,"SM2","Single",138000]
[2009,"SM2-AP/SM3","Single",138000]
[2009,"No bridging","Single",102000]
[2009,"SM2","Double",181000]
[2009,"SM2-AP/SM3","Double",181000]
[2009,"No bridging","Double",137000]
[2010,"SM2","Single",147000]
[2010,"SM2-AP/SM3","Single",147000]
[2010,"No bridging","Single",108000]
[2010,"SM2","Double (Type 1)",152000]
[2010,"SM2-AP/SM3","Double (Type 1)",152000]
[2010,"No bridging","Double (Type 1)",112000]
[2010,"SM2","Double (Type 2)",191000]
[2010,"SM2-AP/SM3","Double (Type 2)",191000]
[2010,"No bridging","Double (Type 2)",147000]
[2011,"SM2","Single",157000]
[2011,"SM2-AP/SM3","Single",157000]
[2011,"No bridging","Single",114000]
[2011,"SM2","Double (Type 1)",175000]
[2011,"SM2-AP/SM3","Double (Type 1)",175000]
[2011,"No bridging","Double (Type 1)",132000]
[2011,"SM2","Double (Type 2)",205000]
[2011,"SM2-AP/SM3","Double (Type 2)",205000]
[2011,"No bridging","Double (Type 2)",159000]
[2012,"SM2 (20 MTHS)","Single",172000]
[2012,"SM2 (12 MTHS)","Single",172000]
[2012,"SM3","Single",172000]
[2012,"No bridging","Single",127000]
[2012,"SM2 (20 MTHS)","Double (Type 1)",181000]
[2012,"SM2 (12 MTHS)","Double (Type 1)",181000]
[2012,"SM3","Double (Type 1)",181000]
[2012,"No bridging","Double (Type 1)",136000]
[2012,"SM2 (20 MTHS)","Double (Type 2)",216000]
[2012,"SM2 (12 MTHS)","Double (Type 2)",216000]
[2012,"SM3","Double (Type 2)",216000]
[2012,"No bridging","Double (Type 2)",166000]
[2013,"SM2 (20 MTHS)","Single",163000]
[2013,"SM2 (12 MTHS)","Single",163000]
[2013,"No bridging","Single",126000]
[2013,"SM2 (20 MTHS)","Double (Type 1)",173000]
[2013,"SM2 (12 MTHS)","Double (Type 1)",173000]
[2013,"No bridging","Double (Type 1)",136000]
[2013,"No bridging","Double (Type 2)",166000]
[2014,"SM2 (12 MTHS)","Single",159000]
[2014,"No bridging","Single",129000]
[2014,"SM2 (12 MTHS)","Double (Type 1)",169000]
[2014,"No bridging","Double (Type 2)",169000]
[2015,"SM2 (12 MTHS)","Single",158000]
[2015,"No bridging","Single",133000]
[2015,"No bridging","Double (Type 1)",144000]
[2016,"SM2 (12 MTHS)","Single",165000]
[2016,"No bridging","Single",139000]
[2016,"No bridging","Double (Type 1)",151000]
[2017,"SM2 (12 MTHS)","Single",168000]
[2017,"No bridging","Single",148000]
[2017,"No bridging","Double (Type 1)",161000]
[2018,"SM2 (12 MTHS)","Single",168000]
[2018,"No bridging","Single",142000]
[2018,"No bridging","Double (Type 1)",155000]
[2019,"SM2 (12 MTHS)","Single",171000]
[2019,"No bridging","Single",142000]
[2019,"No bridging","Double (Type 1)",120000]
[2020,"SM2 (12 MTHS)","Single",171000]
[2020,"No bridging","Single",144000]
[2020,"No bridging","Double (Type 1)",157000]

{"sheet":"OutcomeForm","index":4,"n_rows":23,"n_cols":8,"rows_kept":23,"cut":false,"hidden":false,"merged":[[12,0,12,8],[13,0,13,8],[15,0,15,8],[18,0,18,8],[20,0,20,8],[2,0,2,8],[8,6,8,8],[5,0,5,5],[6,0,6,5],[7,0,7,5],[8,0,8,5],[11,0,11,8],[4,0,4,5],[4,6,4,8],[5,6,5,8],[6,6,6,8],[7,6,7,8]]}
[]
[]
["Your *estimated LD for your remaining 6-year NTU-SE / NTU-ST bond obligation is calculated as follows:"]
[]
["Details",null,null,null,null,null,"Amount in SGD"]
["  Estimated LD for your cohort:",null,null,null,null,null,{"$f":"SUMIFS('LD Table'!$D$104:$D$200,'LD Table'!$A$104:$A$200,ResponseForm!B2,'LD Table'!$B$104:$B$200,ResponseForm!C2,'LD Table'!$C$104:$C$200,ResponseForm!D2)","v":0}]
["  Existing Banker's Guarantee (BG) placed:",null,null,null,null,null,{"$f":"ResponseForm!E2","v":0}]
[]
["Estimated LD Total Amount:",null,null,null,null,null,{"$f":"$G$6-$G$7","v":0}]
[]
[]
["Please note that if you wish to defer your bond to pursue a Postgraduate study, the Banker's Guarantee (BG) will be as follows:"]
["Local institution in Singapore: 20% of LD amount"]
["Any other institutions overseas: 100% of LD amount"]
[]
["Any other reasons for deferment *approved by your sponsor: 100% of LD amount"]
[]
[]
["If you have been employed and wish to count your employment period into reducing your BG/LD amount, please write to us at gradscholars@ntu.edu.sg for further assistance.\n*Please note that you will be required to submit all your employment documents and other necessary supporting documents for our office to process your deferment."]
[]
["If you have any further clarification on your LD/BG amount, please ensure that you have completed this LD calculation before you write to us at gradscholars@ntu.edu.sg for assistance."]
[]
[null,null,null,null,null,null,null,"Thank you."]