{"text_format":"1","workbook":"xlsx","n_sheets":5,"sheets":["Form","Dropdown","ResponseForm","LD Table","OutcomeForm"],"not_rendered":{"charts":0,"images":3,"macros":1,"external_links":0,"defined_names":1,"comments":1,"pivot_tables":0},"unopened":[],"bounds":{"document_bytes":16777216,"sheet_cells":100000,"rows_first":2000,"rows_last":500,"rows_between":2000,"halvings":0,"cell_chars":16384,"cell_head_chars":4096},"cells_cut":0,"cells_raw":0,"read":"whole","date_system":"1900"}

{"sheet":"Form","index":0,"n_rows":19,"n_cols":8,"rows_kept":19,"cut":false,"hidden":false,"merged":[[17,1,17,4],[13,1,13,4],[17,5,17,6],[16,1,16,6],[1,2,1,7],[15,1,15,6],[5,5,5,6],[7,5,7,6],[9,5,9,6],[11,5,11,6],[13,5,13,6]]}
[]
[null,null,"Estimated LD Calculation Form"]
[]
[null,"*All fields are mandatory. Please do not leave any blanks."]
[]
["*","Undergraduate Matric No.:"]
[]
["*","Matriculation Year:",null,null,null,{"$f":"VLOOKUP($F$6,Dropdown!A13:B32,2,TRUE)","v":{"$error":"#N/A"}},null,"e.g. 2019, 2020"]
[]
["*","Scholarship Scheme",null,null,null,{"$f":"VLOOKUP($F$6,Dropdown!E2:G5281,3,FALSE)","v":{"$error":"#N/A"}}]
[]
["*","Degree Type",null,null,null,{"$f":"VLOOKUP($F$6,Dropdown!E2:I5281,4,FALSE)","v":{"$error":"#N/A"}}]
[]
["*","Do you have any existing BG placed for"]
[null,"your deferment?"]
[null,{"$f":"IF($F14=\"Yes\",\"You have selected, Yes. Please input your BG amount in the section below.\",\"\")","v":""}]
[null,{"$f":"IF($F14=\"No\",\"You have selected, No. Please input 0 in the section below.\",\"\")","v":""}]
["*","Please enter your BG amount, if any"]
[null,"(BG is in SGD, please do not key in $ sign)"]

{"sheet":"Dropdown","index":1,"n_rows":5281,"n_cols":9,"rows_kept":5281,"cut":false,"hidden":true,"merged":[]}
["<Please Select>","<Please Select>",null,"SCHOLAR NAME","MATRIC NO","SCHEME","SCHEME_EDITED","DEGREE TYPE","COURSE"]
["No bridging","Single",null,"LONG TAO","001511A03","SM3","SM2-AP/SM3",{"$f":"VLOOKUP(I$1:I$5281,$A$37:$B$212,2,FALSE)","v":"Single"},"EEE"]
["SM2-RP","Double",null,"SETHIA ADITYA","003677D07","Direct","No bridging","Single","MAT"]
["SM2-AP/SM3","Double (Type 1)",null,"MAO DINGTAO","010004E03","SM3","SM2-AP/SM3","Single","EEE"]
["SM2 (20 MTHS)","Double (Type 2)",null,"CHEN HAOMIN","010025B03","SM2 (Accelerated)","SM2-AP/SM3","Single","MPE"]
["SM2 (12 MTHS)",null,null,"LI RUI","010027F03","SM3","SM2-AP/SM3","Single","EEE"]
["SM3",null,null,"WANG RUI","010042B03","SM3","SM2-AP/SM3","Single","EEE"]
[null,null,null,"KANG BAOXIANG","010044F03","SM3","SM2-AP/SM3","Single","EEE"]
[null,null,null,"LENG ZILI","010067G03","SM3","SM2-AP/SM3","Single","EEE"]
[null,null,null,"FENG LIGUO","010089F03","SM3","SM2-AP/SM3","Single","EEE"]
[null,null,null,"XIAO LIANHOU","010095A03","SM3","SM2-AP/SM3","Single","EEE"]
["Matric starts with…","Year",null,"LU FEN","010102E03","SM3","SM2-AP/SM3","Single","EEE"]
["01",2001,null,"WANG YANG","010103G03","SM3","SM2-AP/SM3","Single","EEE"]
["02",2002,null,"ZHANG YAO","010106B03","SM3","SM2-AP/SM3","Single","EEE"]
["03",2003,null,"ZHANG XIN (F2589661X)","010115C03","MOE PreU Scholar (PRC)","No bridging","Single","EEE"]
["04",2004,null,"SHI WEN","010135J03","SM3","SM2-AP/SM3","Single","EEE"]
["05",2005,null,"ZHOU HUIJUN","010158K03","SM3","SM2-AP/SM3","Single","EEE"]
["06",2006,null,"SHANG LONG","010162A03","SM2","SM2-RP","Single","EEE"]
["07",2007,null,"CUI SONG","010165G03","SM2 (Accelerated)","SM2-AP/SM3","Single","EEE"]
["08",2008,null,"HU KUN","010171B03","SM3","SM2-AP/SM3","Single","EEE"]
["U09",2009,null,"ZHAO MING","010179G03","SM3","SM2-AP/SM3","Single","EEE"]
["U10",2010,null,"HAO ZHIYONG","010197J03","SM3","SM2-AP/SM3","Single","EEE"]
["U11",2011,null,"FU YING","010208K03","SM3","SM2-AP/SM3","Single","EEE"]
["U12",2012,null,"ZHANG YU (150052688)","010230C03","SM3","SM2-AP/SM3","Single","EEE"]
["U13",2013,null,"CHEN LIN (150442624)","010247J03","SM3","SM2-AP/SM3","Single","EEE"]
["U14",2014,null,"GE TONG","010249B03","SM2","SM2-RP","Single","EEE"]
["U15",2015,null,"LU JUNLONG","010254F03","SM3","SM2-AP/SM3","Single","EEE"]
["U16",2016,null,"WU DI","010255H03","SM3","SM2-AP/SM3","Single","EEE"]
["U17",2017,null,"CHU HAIZHOU","010256K03","SM3","SM2-AP/SM3","Single","EEE"]
["U18",2018,null,"LI LINTAO","010261C03","SM3","SM2-AP/SM3","Single","EEE"]
["U19",2019,null,"JIANG ZONGQI","010274A03","SM2","SM2-RP","Single","EEE"]
["U20",2020,null,"CHEN JUNJIE","010276E03","SM3","SM2-AP/SM3","Single","EEE"]
[null,null,null,"LI XIANGNAN","010293E03","SM3","SM2-AP/SM3","Single","EEE"]
[null,null,null,"ZHAO JIHUA","010295J03","SM3","SM2-AP/SM3","Single","EEE"]
[null,null,null,"WANG ZHISHUAI","010297B03","SM3","SM2-AP/SM3","Single","EEE"]
["PROGRAMME CODE","DEGREE TYPE",null,"ABHISHEK GUPTA","010299F03","SIA Youth","No bridging","Single","EEE"]
["ABET","Double",null,"LI WEI (G00241105)","010305H03","SM3","SM2-AP/SM3","Single","EEE"]
["ABTD","Double",null,"ZHUANG ZHENGDA","010327G03","MOE PreU Scholar (PRC)","No bridging","Single","EEE"]
["ACBS","Double",null,"WANG LIANG","010335F03","SM2 (Accelerated)","SM2-AP/SM3","Single","EEE"]
["ACC","Single",null,"WANG JUN (G00241109)","010347B03","SM3","SM2-AP/SM3","Single","EEE"]
["ACDA","Double",null,"ANNA REGINA","010356C03","MOE PreU Scholar (ASEAN)","No bridging","Single","MPE"]
["ACET","Single",null,"TANG WENLI","010357E03","SM2","SM2-RP","Single","EEE"]
["ACFA","Single",null,"ZHAN CHUNLEI","010364B03","SM3","SM2-AP/SM3","Single","EEE"]
["ACSC","Single",null,"LIU LEI (147660000)","010366F03","SM2","SM2-RP","Single","EEE"]
["ACTD","Single",null,"PUNGKY PRADOTO","010380L03","Direct","No bridging","Single","EEE"]
["ADDA","Single",null,"XU JUN","010381B03","SM3","SM2-AP/SM3","Single","EEE"]
["ADM","Single",null,"YANG MING (G00241111)","010387C03","SM3","SM2-AP/SM3","Single","EEE"]
["AERO","Single",null,"LI MING","010394L03","SM3","SM2-AP/SM3","Single","EEE"]
["ARED","Single",null,"FU PENG","010405A03","SM3","SM2-AP/SM3","Single","EEE"]
["ASBM","Single",null,"LI ZHE (G00241104)","010406C03","SM3","SM2-AP/SM3","Single","EEE"]
["ASBZ","Single",null,"SUN ZHENGLONG","010407E03","SM3","SM2-AP/SM3","Single","EEE"]
["ASDA","Single",null,"LI HAOXIN","010444L03","SM3","SM2-AP/SM3","Single","EEE"]
["ASEC","Double",null,"YANG SHU","010457J03","SM2","SM2-RP","Single","EEE"]
["ASET","Single",null,"HAN YEHUA","010458L03","SM3","SM2-AP/SM3","Single","EEE"]
["ASTD","Single",null,"QIN JING","010463D03","SM2","SM2-RP","Single","EEE"]
["BCE","Double (Type 1)",null,"PENG NING","010466K03","SM3","SM2-AP/SM3","Single","EEE"]
["BCG","Double (Type 1)",null,"HUANG TAO","010514F03","SM2","SM2-RP","Single","EEE"]
["BEBM","Single",null,"HUANG MINGMING","010528F03","SM3","SM2-AP/SM3","Single","EEE"]
["BEBZ","Single",null,"WU LIN","010546H03","SM3","SM2-AP/SM3","Single","EEE"]
["BEDA","Single",null,"LIANG XUEBIN","010556L03","SM3","SM2-AP/SM3","Single","EEE"]
["BEEC","Double (Type 2)",null,"DENG WU","010557B03","SM2","SM2-RP","Single","EEE"]
["BEET","Single",null,"IRWAN MOHAMMAD","010563H03","Direct","No bridging","Single","MPE"]
["BEFS","Single",null,"HAJAR SENOHADI SUSILO","010575D03","Direct","No bridging","Single","EEE"]
["BEPE","Single",null,"LING YONG","010581K03","SM3","SM2-AP/SM3","Single","EEE"]
["BETD","Single",null,"GUPTA RUCHI","010591B03","Direct","No bridging","Single","EEE"]
["BIE","Single",null,"RATH SAMIR","010597C03","Direct","No bridging",{"$f":"VLOOKUP(I$1:I$5281,$A$37:$B$212,2,FALSE)","v":"Single"},"EEE"]
["BMS","Double",null,"SUREKA RIMA SUDARSHAN","010604G03","Direct","No bridging","Single","EEE"]
["BS","Single",null,"YANG JIANBO","010609F03","SM3","SM2-AP/SM3","Single","EEE"]
["BSB","Single",null,"CHEN ZHIMING","010621G03","SM3","SM2-AP/SM3","Single","EEE"]
["BSBZ","Single",null,"DALVI ABHAY SHASHANK","010623L03","Direct","No bridging","Single","EEE"]
["BSCB","Single",null,"YU YING","010636J03","SM3","SM2-AP/SM3","Single","EEE"]
["BSDA","Single",null,"MENG YUSONG","010647C03","SM3","SM2-AP/SM3","Single","EEE"]
["BSFS","Single",null,"NIU SHIJIE","010654L03","SM3","SM2-AP/SM3","Single","EEE"]
["BSMT","Single",null,"CHEN YI","010663A03","SM3","SM2-AP/SM3","Single","EEE"]
["BSPY","Single",null,"SONG HUILAI","010681C03","SM3","SM2-AP/SM3","Single","EEE"]
["BSSB","Single",null,"LU LINHUI","010685L03","SM2 (Accelerated)","SM2-AP/SM3","Single","EEE"]
["BUET","Single",null,"TIAN YONG","010700C03","SM3","SM2-AP/SM3","Single","CEE"]
["BUS","Single",null,"SANTHANAM SUBA","010711H03","Direct","No bridging","Single","EEE"]
["BUSC","Single",null,"VARUN NARAYAN VISWANATH","010716G03","Direct","No bridging","Single","EEE"]
["BUTD","Single",null,"TEGUH DANIEL TAMPEMAWA","010718L03","MOE PreU Scholar (ASEAN)","No bridging","Single","MPE"]
["CBBM","Single",null,"ZHANG GUO","010742H03","SM2","SM2-RP","Single","EEE"]
["CBBZ","Single",null,"YAMINI JAGANNADHAN","010751J03","Direct","No bridging","Single","EEE"]
["CBDA","Single",null,"LIN JIANYONG","010762C03","SM3","SM2-AP/SM3","Single","EEE"]
["CBE","Single",null,"WANG MENGDI","010809C03","SM3","SM2-AP/SM3","Single","EEE"]
["CBEC","Double (Type 2)",null,"SUN ZHENGLIANG","010810K03","SM3","SM2-AP/SM3","Single","EEE"]
["CBET","Single",null,"PANG YI","010816L03","SM3","SM2-AP/SM3","Single","EEE"]
["CBFS","Single",null,"JIA XIAOWEI","010818D03","SM2","SM2-RP","Single","EEE"]
["CBTD","Single",null,"GONG YING","010829J03","SM3","SM2-AP/SM3","Single","EEE"]
["CE","Single",null,"CHEN MING (150101485)","010864L03","SM3","SM2-AP/SM3","Single","EEE"]
["CEBM","Single",null,"VIKRAM BAJAJ","010873A03","Direct","No bridging","Single","EEE"]
["CEBZ","Single",null,"HE JIAO","010896B03","SM2","SM2-RP","Single","EEE"]
["CEDA","Single",null,"PERDANA HADI AINIANTA","010912G03","Direct","No bridging","Single","EEE"]
["CEE","Single",null,"QUE YI","010914L03","SM2","SM2-RP","Single","ME"]
["CEEC","Double (Type 2)",null,"ZHU JIA","010928L03","SM3","SM2-AP/SM3","Single","EEE"]
["CEET","Single",null,"VALDY OKTAFIANZA","010930J03","Direct","No bridging","Single","EEE"]
["CETD","Single",null,"WU JIE","010977B03","SM3","SM2-AP/SM3","Single","EEE"]
["CHDA","Single",null,"LENG SHUANG","010987E03","SM3","SM2-AP/SM3","Single","EEE"]
["CHEM","Single",null,"ZHU ZHIMING","011016H03","SM3","SM2-AP/SM3","Single","EEE"]
["CHES","Single",null,"LIU WEN","011017K03","SM3","SM2-AP/SM3","Single","EEE"]
["CHFS","Single",null,"ZHU QI","011020K03","SM3","SM2-AP/SM3","Single","EEE"]
["CHIN","Single",null,"LI TIAN","011028D03","SM2","SM2-RP","Single","EEE"]
["CHTD","Single",null,"ZHANG ZEYUAN","011037E03","SM3","SM2-AP/SM3","Single","EEE"]
["CNEL","Single",null,"BEKTI HARSONO","011039J03","Direct","No bridging","Single","EEE"]
["CNLM","Single",null,"YU CHUNXIN","011040E03","SM3","SM2-AP/SM3","Single","EEE"]
["CS","Single",null,"SHANG YANG","011042J03","SM3","SM2-AP/SM3","Single","EEE"]
["CSBM","Single",null,"SUN CHUAN","011052A03","SM3","SM2-AP/SM3","Single","EEE"]
["CSBU","Single",null,"HOU YUEJIN","011059D03","SM3","SM2-AP/SM3","Single","EEE"]
["CSBZ","Single",null,"SU CUI","011066A03","SM3","SM2-AP/SM3","Single","EEE"]
["CSC","Single",null,"LIU XIMING","011076D03","SM3","SM2-AP/SM3","Single","EEE"]
["CSEC","Double",null,"DONG ZHAOGANG","011083A03","SM2 (Accelerated)","SM2-AP/SM3","Single","EEE"]
["CSET","Single",null,"WAN LIANGXUN","011101K03","SM3","SM2-AP/SM3","Single","EEE"]
["CSGR","Single",null,"GUO HAO","011109D03","SM3","SM2-AP/SM3","Single","EEE"]
["CSTD","Single",null,"WANG YAN","011112D03","SM3","SM2-AP/SM3","Single","EEE"]
["CVBM","Single",null,"ZHOU LEI","011117C03","SM3","SM2-AP/SM3","Single","EEE"]
["CVBZ","Single",null,"PAN FENG","011122G03","SM3","SM2-AP/SM3","Single","EEE"]
["CVDA","Single",null,"LI XIANG (147671058)","011129K03","SM2","SM2-RP","Single","EEE"]
["CVEC","Double (Type 2)",null,"LI DANPING","011133A03","SM3","SM2-AP/SM3","Single","EEE"]
["CVET","Single",null,"GAO SHU","011146K03","SM3","SM2-AP/SM3","Single","EEE"]
["CVSU","Single",null,"YANG ZHONGBAO","011154J03","SM3","SM2-AP/SM3","Single","CEE"]
["CVTD","Single",null,"WANG YUBO","011169L03","SM3","SM2-AP/SM3","Single","EEE"]
{"$rows_left_out":5162}
{"sheet":"ResponseForm","index":2,"n_rows":1,"n_cols":5,"rows_kept":1,"cut":false,"hidden":true,"merged":[]}
["Matric No.","Matric Year","Scheme","Deg Type","BG Amt"]

{"sheet":"LD Table","index":3,"n_rows":200,"n_cols":4,"rows_kept":200,"cut":false,"hidden":true,"merged":[]}
["Matric Year","Scheme","Degree Type","BG Amt"]
[2001,"SM2","Single",125000]
[2001,"SM2-AP/SM3","Single",105000]
[2001,"No bridging","Single",85000]
[2002,"SM2","Single",125000]
[2002,"SM2-AP/SM3","Single",105000]
[2002,"No bridging","Single",85000]
[2003,"SM2","Single",125000]
[2003,"SM2-AP/SM3","Single",116000]
[2003,"No bridging","Single",85000]
[2004,"SM2","Single",125000]
[2004,"SM2-AP/SM3","Single",116000]
[2004,"No bridging","Single",85000]
[2005,"SM2","Single",125000]
[2005,"SM2-AP/SM3","Single",116000]
[2005,"No bridging","Single",85000]
[2006,"SM2","Single",125000]
[2006,"SM2-AP/SM3","Single",130000]
[2006,"No bridging","Single",85000]
[2006,"SM2","Double ",125000]
[2006,"SM2-AP/SM3","Double",130000]
[2007,"SM2","Single",122000]
[2007,"SM2-AP/SM3","Single",97000]
[2007,"No bridging","Single",159000]
[2007,"SM2","Double ",159000]
[2007,"SM2-AP/SM3","Double",129000]
[2007,"No bridging","Double ",112000]
[2008,"SM2","Single",137000]
[2008,"SM2-AP/SM3","Single",111000]
[2008,"No bridging","Single",100000]
[2008,"SM2","Double ",173000]
[2008,"SM2-AP/SM3","Double ",150000]
[2008,"No bridging","Double ",131000]
[2009,"SM2","Single",138000]
[2009,"SM2-AP/SM3","Single",112000]
[2009,"No bridging","Single",102000]
[2009,"SM2","Double ",181000]
[2009,"SM2-AP/SM3","Double",156000]
[2009,"No bridging","Double",137000]
[2010,"SM2","Single",147000]
[2010,"SM2-AP/SM3","Single",118000]
[2010,"No bridging","Single",108000]
[2010,"SM2","Double (Type 1)",152000]
[2010,"SM2-AP/SM3","Double (Type 1)",123000]
[2010,"No bridging","Double (Type 1)",112000]
[2010,"SM2","Double (Type 2)",191000]
[2010,"SM2-AP/SM3","Double (Type 2)",159000]
[2010,"No bridging","Double (Type 2)",147000]
[2011,"SM2","Single",157000]
[2011,"SM2-AP/SM3","Single",135000]
[2011,"No bridging","Single",114000]
[2011,"SM2","Double (Type 1)",175000]
[2011,"SM2-AP/SM3","Double (Type 1)",154000]
[2011,"No bridging","Double (Type 1)",132000]
[2011,"SM2","Double (Type 2)",205000]
[2011,"SM2-AP/SM3","Double (Type 2)",182000]
[2011,"No bridging","Double (Type 2)",159000]
[2012,"SM2 (20 MTHS)","Single",172000]
[2012,"SM2 (12 MTHS)","Single",162000]
[2012,"SM3","Single",144000]
[2012,"No bridging","Single",112700]
[2012,"SM2 (20 MTHS)","Double (Type 1)",181000]
[2012,"SM2 (12 MTHS)","Double (Type 1)",171000]
[2012,"SM3","Double (Type 1)",153000]
[2012,"No bridging","Double (Type 1)",136000]
[2012,"SM2 (20 MTHS)","Double (Type 2)",216000]
[2012,"SM2 (12 MTHS)","Double (Type 2)",205000]
[2012,"SM3","Double (Type 2)",185000]
[2012,"No bridging","Double (Type 2)",166000]
[2013,"SM2 (20 MTHS)","Single",163000]
[2013,"SM2 (12 MTHS)","Single",161000]
[2013,"No bridging","Single",126000]
[2013,"SM2 (20 MTHS)","Double (Type 1)",173000]
[2013,"SM2 (12 MTHS)","Double (Type 1)",171000]
[2013,"No bridging","Double (Type 1)",136000]
[2013,"No bridging","Double (Type 2)",166000]
[2014,"SM2 (12 MTHS)","Single",159000]
[2014,"No bridging","Single",207000]
[2014,"SM2 (12 MTHS)","Double (Type 1)",169000]
[2014,"No bridging","Double (Type 2)",169000]
[2015,"SM2 (12 MTHS)","Single",158000]
[2015,"No bridging","Single",133000]
[2015,"No bridging","Double (Type 1)",144000]
[2016,"SM2 (12 MTHS)","Single",165000]
[2016,"No bridging","Single",139000]
[2016,"No bridging","Double (Type 1)",151000]
[2017,"SM2 (12 MTHS)","Single",168000]
[2017,"No bridging","Single",148000]
[2017,"No bridging","Double (Type 1)",161000]
[2018,"SM2 (12 MTHS)","Single",168000]
[2018,"No bridging","Single",142000]
[2018,"No bridging","Double (Type 1)",155000]
[2019,"SM2 (12 MTHS)","Single",171000]
[2019,"No bridging","Single",142000]
[2019,"No bridging","Double (Type 1)",120000]
[2020,"SM2 (12 MTHS)","Single",171000]
[2020,"No bridging","Single",144000]
[2020,"No bridging","Double (Type 1)",157000]
[]
[]
[]
[]
["Matric Year","Scheme","Degree Type","LD Amt"]
[2001,"SM2","Single",125000]
[2001,"SM2-AP/SM3","Single",105000]
[2001,"No bridging","Single",85000]
[2002,"SM2","Single",125000]
[2002,"SM2-AP/SM3","Single",105000]
[2002,"No bridging","Single",85000]
[2003,"SM2","Single",125000]
[2003,"SM2-AP/SM3","Single",116000]
[2003,"No bridging","Single",85000]
[2004,"SM2","Single",125000]
[2004,"SM2-AP/SM3","Single",116000]
[2004,"No bridging","Single",85000]
[2005,"SM2","Single",125000]
[2005,"SM2-AP/SM3","Single",116000]
[2005,"No bridging","Single",85000]
[2006,"SM2","Single",125000]
[2006,"SM2-AP/SM3","Single",130000]
{"$rows_left_out":81}
{"sheet":"OutcomeForm","index":4,"n_rows":23,"n_cols":8,"rows_kept":23,"cut":false,"hidden":false,"merged":[[12,0,12,8],[13,0,13,8],[15,0,15,8],[18,0,18,8],[20,0,20,8],[2,0,2,8],[8,6,8,8],[5,0,5,5],[6,0,6,5],[7,0,7,5],[8,0,8,5],[11,0,11,8],[4,0,4,5],[4,6,4,8],[5,6,5,8],[6,6,6,8],[7,6,7,8]]}
[]
[]
["Your *estimated LD for your remaining 6-year NTU-SE / NTU-ST bond obligation is calculated as follows:"]
[]
["Details",null,null,null,null,null,"Amount in SGD"]
["  Estimated LD for your cohort:",null,null,null,null,null,{"$f":"SUMIFS('LD Table'!$D$104:$D$200,'LD Table'!$A$104:$A$200,ResponseForm!B2,'LD Table'!$B$104:$B$200,ResponseForm!C2,'LD Table'!$C$104:$C$200,ResponseForm!D2)","v":0}]
["  Existing Banker's Guarantee (BG) placed:",null,null,null,null,null,{"$f":"ResponseForm!E2","v":0}]
[]
["Estimated LD Total Amount:",null,null,null,null,null,{"$f":"$G$6-$G$7","v":0}]
[]
[]
["Please note that if you wish to defer your bond to pursue a Postgraduate study, the Banker's Guarantee (BG) will be as follows:"]
["Local institution in Singapore: 20% of LD amount"]
["Any other institutions overseas: 100% of LD amount"]
[]
["Any other reasons for deferment *approved by your sponsor: 100% of LD amount"]
[]
[]
["If you have been employed and wish to count your employment period into reducing your BG/LD amount, please write to us at gradscholars@ntu.edu.sg for further assistance.\n*Please note that you will be required to submit all your employment documents and other necessary supporting documents for our office to process your deferment."]
[]
["If you have any further clarification on your LD/BG amount, please ensure that you have completed this LD calculation before you write to us at gradscholars@ntu.edu.sg for assistance."]
[]
[null,null,null,null,null,null,null,"Thank you."]